program: Gaussian 09
title: 000103443
version: EM64L-G09RevD.01
frameworkgroup: C1[X(C11H21N5O)]
method: RPBEPBE
basis: SDD
operation: Freq
keyword: #p
keyword: freq=noraman
keyword: PBEPBE/SDD
title: #p freq=noraman PBEPBE/SDD
converged: YES YES NO NO
title: Mulliken charges:
elementType: O N N N N N C C C C C C C C C C C H H H H H H H H H H H H H H H H H H H H H
charge: -0.206227 -0.404232 -0.404181 -0.484826 -0.082589 -0.082691 -0.418081 -0.418139 -0.293436 -0.293438 -0.341020 -0.340994 0.260023 0.259973 -0.688764 -0.688770 -0.098981 0.201494 0.195483 0.201454 0.195536 0.237560 0.243520 0.243420 0.237616 0.203404 0.204379 0.203413 0.204362 0.293969 0.293975 0.286447 0.208129 0.222897 0.209145 0.208137 0.222896 0.209136
chargesum: 0.00000
title: Mulliken charges with hydrogens summed into heavy atoms:
elementType: O N N N N N C C C C C C C C C C C
charge: -0.206227 -0.110263 -0.110206 -0.198378 -0.082589 -0.082691 -0.021104 -0.021149 0.187643 0.187598 0.066763 0.066782 0.260023 0.259973 -0.048593 -0.048601 -0.098981
polarizability: 2.29451863e+02 -8.84635763e-04 1.69582888e+02 -7.52710035e-01 1.75558636e-02 1.02296229e+02
1716.lowfreq: -53.5052 -20.3840 -7.4674 -0.0011 0.0003 0.0012 2.4039 11.8785 22.3450
frequency: -53.3698 -20.3816 22.3101 40.6902 56.5328 67.3260 77.5323 94.3963 96.6843 125.4580 158.6540 172.5910 175.3657 190.3148 199.1248 205.8526 230.6229 237.2619 244.5475 266.5103 307.0294 369.4035 375.6708 464.4403 468.9368 509.8816 546.8191 548.4501 658.0059 670.8603 691.0083 696.9206 733.2467 733.3603 759.0948 789.3778 789.6522 868.8904 893.2238 905.5227 934.1640 936.0413 937.4177 1006.2940 1025.5052 1055.8631 1074.3810 1080.0143 1081.2886 1092.5297 1131.4957 1137.8987 1156.3791 1156.4939 1190.1393 1212.2598 1222.9262 1222.9451 1259.6195 1272.5602 1272.6390 1275.6810 1290.4312 1290.7658 1298.7231 1339.8604 1349.9412 1358.0036 1363.7350 1366.8704 1393.8171 1393.8676 1466.9584 1467.9637 1473.5624 1473.9912 1476.8604 1480.2535 1480.2624 1485.7698 1485.8600 1499.0679 1499.7159 1513.6460 1593.1529 1596.1992 1659.0294 2953.9196 2953.9930 2974.8976 2974.9512 2978.3308 2978.3597 2993.5056 2993.6222 2999.6370 2999.7073 3029.3780 3029.4315 3051.7392 3051.8800 3071.7338 3071.7847 3077.2459 3077.2763 3530.5238 3563.5106 3564.2835
redmass: 1.8883 2.0616 3.6321 4.0510 2.2519 2.0104 3.8306 2.8328 2.0679 2.3702 3.9160 1.5498 3.5101 4.1510 4.2708 3.2530 1.6611 1.1267 2.1464 1.2718 4.7081 3.4670 3.0162 3.7828 5.4541 1.2057 6.1913 10.0092 11.1125 6.1879 7.2257 9.2342 1.0710 1.0765 11.5920 1.1445 1.1483 6.9315 2.2020 1.9426 2.0526 1.1633 1.6277 4.9438 3.3990 3.2835 2.5753 2.8602 2.7601 3.2036 2.9098 3.4139 1.6339 1.6395 3.3405 1.8144 1.2835 1.2841 1.4020 1.1183 1.1208 1.3641 1.0923 1.0843 1.5189 1.3654 1.5231 2.4288 1.9910 1.6102 1.2153 1.2164 1.1077 1.0729 1.1015 1.0666 1.4997 1.0421 1.0421 1.0722 1.0722 1.0835 1.0785 2.7366 3.8044 8.8403 11.2206 1.0584 1.0585 1.0359 1.0359 1.0601 1.0601 1.0650 1.0652 1.0941 1.0940 1.1026 1.1026 1.1048 1.1047 1.1012 1.1013 1.0991 1.0991 1.0781 1.0778 1.0778
irintensity: 10.3855 0.0048 1.4451 0.2695 0.0129 1.5836 5.7348 2.0885 0.0051 0.9971 0.0016 31.0020 0.4033 4.5130 0.0976 0.0162 15.6221 0.0023 26.1825 0.1542 0.0616 0.0863 0.8445 0.0020 1.9409 227.3035 0.0177 0.1055 0.0001 36.8109 6.6591 1.2877 0.2504 15.6598 27.5697 0.0198 1.9767 0.0091 1.0827 1.4118 56.9358 0.0338 37.7530 0.0116 0.9959 0.6630 49.4550 9.1304 0.4670 0.9456 31.6682 1.0805 0.9113 0.0404 297.0079 36.0533 0.1299 1.7995 4.7707 0.0450 3.3283 44.5099 0.1846 0.9460 2.7896 1.4073 1.0951 27.7886 4.1832 11.1480 5.6153 9.1679 76.5405 1.0243 44.7776 0.1354 310.0705 9.7686 17.1501 18.5853 6.6636 43.8710 37.8270 96.9799 977.4952 926.6856 63.5811 1.5109 38.6416 42.8939 46.0879 8.7994 51.7463 21.3164 26.5177 10.2242 10.4049 7.0910 5.3534 25.3429 37.0535 3.1623 188.4053 53.0329 41.1031 5.1164 33.7972 36.9444
temp: 298.150 k
press: 1.00000 atm
elementType: 8 7 7 7 7 7 6 6 6 6 6 6 6 6 6 6 6 1 1 1 1 1 1 1 1 1 1 1 1 1 1 1 1 1 1 1 1 1
symmnumber: 1
zpe: 844528.4 jmol-1
zpe.correction: 0.321664 hartree
zpe.thermalcorrener: 0.340324 hartree
zpe.thermalcorrenthalpy: 0.341268 hartree
zpe.thermalcorrgfe: 0.273116 hartree
zpe.sumelectzpe: -779.425271 hartree
zpe.sumelectthermal: -779.406611 hartree
zpe.sumelectthermalent: -779.405667 hartree
zpe.sumelectthermalfe: -779.473819 hartree
dipole: 0.0005 -11.2104 -0.0031
dipole: 11.2104
quadrupole: -78.5522 -122.5474 -104.2195
quadrupole: -0.0004 -0.2292 -0.0023
quadrupole: 23.2209 -20.7744 -2.4465 -0.0004 -0.2292 -0.0023
hfenergy: -779.7469349 hartree
pointgroup: C01 [X(C11H21N5O1)]
dipole: 0.0015715 -4.4105064 0.0017569 debye
polarizability: 229.4545315|0.0249438|169.5828927|-0.4753658|-0.0259235|102.2935559 unknown
InChI: InChI=1S/C11H21N5O/c1-3-5-7-12-9-14-10(13-8-6-4-2)16-11(17)15-9/h12-14H,3-8H2,1-2H3
charge 0 multiplicity 1
38 atoms
O  -0.001483 3.239256 -0.00114
N  -2.372488 -0.803562 0.024938
N  2.37323 -0.801485 -0.022718
N  0.000375 -0.807711 0.001002
N  -1.237697 1.251775 0.015905
N  1.23667 1.252912 -0.015438
C  -4.824491 -1.176506 -0.024089
C  4.825523 -1.172671 0.024426
C  -3.690681 -0.137227 0.045013
C  3.690817 -0.134224 -0.043257
C  -6.218811 -0.510139 0.012309
C  6.219236 -0.505106 -0.012334
C  -1.207514 -0.070894 0.014488
C  1.207665 -0.069773 -0.012963
C  -7.371261 -1.533554 -0.065009
C  7.37265 -1.527555 0.063383
C  -0.000985 1.983367 -0.000075
H  -4.729523 -1.772934 -0.955382
H  -4.739333 -1.884909 0.82698
H  4.731615 -1.769855 0.955349
H  4.740399 -1.880537 -0.827092
H  -3.773936 0.477081 0.962086
H  -3.747205 0.567405 -0.805535
H  3.747563 0.569957 0.807673
H  3.773071 0.480732 -0.959994
H  -6.313024 0.086374 0.941554
H  -6.301066 0.20741 -0.828195
H  6.312314 0.092258 -0.941148
H  6.301417 0.211829 0.828702
H  -2.344825 -1.823205 0.032635
H  2.346357 -1.821161 -0.029987
H  0.0008 -1.828824 0.001442
H  -7.328507 -2.246482 0.780047
H  -8.355044 -1.031631 -0.03246
H  -7.322423 -2.119065 -1.002471
H  7.329972 -2.239823 -0.782235
H  8.355967 -1.024733 0.030602
H  7.324955 -2.113892 1.000388
