program: Gaussian 09
title: 000103437
version: EM64L-G09RevD.01
frameworkgroup: C1[X(C8H5ClF3NO)]
method: RPBEPBE
basis: SDD
operation: Freq
keyword: #p
keyword: freq=noraman
keyword: PBEPBE/SDD
title: #p freq=noraman PBEPBE/SDD
converged: YES YES NO NO
title: Mulliken charges:
elementType: Cl F F F O N C C C C C C C C H H H H H
charge: -0.035770 -0.156106 -0.127140 -0.169958 -0.414063 -0.035987 0.342959 -0.014320 -0.311878 -0.307535 0.302920 -0.221778 -0.222629 -0.102557 0.264646 0.291399 0.261866 0.261147 0.394784
chargesum: 0.00000
title: Mulliken charges with hydrogens summed into heavy atoms:
elementType: Cl F F F O N C C C C C C C C
charge: -0.035770 -0.156106 -0.127140 -0.169958 -0.019278 -0.035987 0.342959 -0.014320 -0.047233 -0.016136 0.302920 0.040088 0.038518 -0.102557
polarizability: 1.74265460e+02 -2.07228803e+01 1.16891533e+02 3.93892515e+00 5.95074114e+00 5.10652171e+01
1716.lowfreq: -7.1896 -4.9726 -0.0020 -0.0017 -0.0008 4.1114 26.5708 58.3113 70.6396
frequency: 26.5434 58.2867 70.6337 124.6264 169.2776 203.1337 229.7559 266.3929 277.6017 326.3718 344.0160 370.9729 400.3350 404.3154 445.9154 490.6832 497.3187 513.3016 592.8561 622.3324 637.4460 655.7769 722.3513 734.8738 823.5168 838.2328 877.9907 947.5568 957.5826 973.0667 979.1149 1000.7232 1061.0804 1081.2416 1126.7463 1150.6105 1212.5173 1278.4630 1308.1248 1315.3238 1371.4679 1407.7112 1480.1356 1564.8537 1574.9373 1597.6970 3166.2128 3167.8576 3187.0616 3210.0576 3547.8723
redmass: 5.0630 10.5133 9.4725 12.6672 11.0538 10.2709 8.1976 8.9021 12.3816 5.6677 12.4698 10.5515 4.9591 4.2414 4.5284 7.2856 3.6699 1.4899 7.6102 7.6041 12.0150 5.4886 3.7970 6.3606 1.3026 1.5748 10.7289 3.5411 2.2068 1.4286 4.4193 4.2100 9.1296 3.1130 1.4422 4.0363 1.1763 4.7493 1.4049 1.3304 5.9260 3.1040 2.2061 6.2525 7.0910 5.9158 1.0895 1.0917 1.0963 1.0945 1.0675
irintensity: 0.2647 0.0005 0.3124 0.5985 0.0289 0.7914 2.2584 2.4440 0.8543 0.8486 3.6047 0.3273 8.8597 4.5845 28.5252 4.4499 2.6760 116.0665 22.6804 4.5097 27.9682 25.4444 12.3157 7.5004 3.9208 53.1554 221.9133 148.7488 78.8194 21.3727 190.4013 10.0082 65.1529 103.2870 0.8298 103.5905 1.0557 62.0726 129.5424 1.2625 23.0583 3.5587 63.3336 5.5790 3.9119 76.2444 0.7404 1.1272 0.8456 2.2709 92.9857
temp: 298.150 k
press: 1.00000 atm
elementType: 17 9 9 9 8 7 6 6 6 6 6 6 6 6 1 1 1 1 1
symmnumber: 1
zpe: 307397.7 jmol-1
zpe.correction: 0.117082 hartree
zpe.thermalcorrener: 0.129712 hartree
zpe.thermalcorrenthalpy: 0.130657 hartree
zpe.thermalcorrgfe: 0.076548 hartree
zpe.sumelectzpe: -1196.340047 hartree
zpe.sumelectthermal: -1196.327416 hartree
zpe.sumelectthermalent: -1196.326472 hartree
zpe.sumelectthermalfe: -1196.380581 hartree
dipole: 0.7384 2.7819 -0.2879
dipole: 2.8926
quadrupole: -96.0119 -72.0702 -88.6285
quadrupole: -7.5366 1.2731 1.6858
quadrupole: -10.4417 13.5000 -3.0583 -7.5366 1.2731 1.6858
hfenergy: -1196.4571288 hartree
pointgroup: C01 [X(C8H5Cl1F3N1O1)]
dipole: 0.3582386 0.892941 0.6078256 debye
dipolederiv: -0.9363547 0.2014239 0.0534808 0.1732394 -0.1172736 -0.0391154 0.0379701 -0.0370621 -0.0971497 -0.4136394 0.0155939 -0.0721661 0.0087462 -0.8142623 0.1100023 -0.0777748 0.0438498 -0.3330697 -0.8959029 0.0301289 0.0747817 -0.0667944 -0.275713 -0.0197081 0.016871 -0.0288113 -0.2916789 -0.4284278 -0.07481 -0.053372 -0.0886358 -0.3496011 -0.0284423 -0.0452983 0.003761 -0.8469675 0.0779267 -0.6081219 -0.3168761 0.1461431 -0.9037032 -0.3444627 0.0896048 -0.3855283 -0.5654584 -0.6199376 0.539872 0.289705 -0.0184112 0.5433076 0.4231291 0.033081 0.4315306 0.1221243 -0.3955527 0.0944992 0.0132095 -0.0201525 -0.0600324 -0.061012 -0.0440315 -0.069961 0.0108221 0.6325088 -0.2199565 -0.0737554 -0.1490304 -0.1517767 -0.0734429 -0.0736759 -0.0099425 -0.1135967 0.1918802 0.0203997 0.0699547 -0.1631458 -0.0039229 0.0662688 -0.1028437 0.1009222 -0.0079999 0.1956573 -0.1186499 -0.0699367 0.0785156 -0.0862526 0.0701738 0.1478075 0.0069466 -0.040672 1.6817308 0.1600283 0.1183396 0.2388797 1.4823174 -0.0392594 0.1189608 -0.0025696 1.479142 -0.4927435 0.0136809 -0.0776817 -0.031289 -0.0517449 0.0715085 -0.1443608 0.0877653 -0.031024 -0.3964659 0.1696879 0.1590612 0.1806556 -0.1402355 0.0099103 0.1858959 -0.0164605 -0.0737043 1.366123 -0.2895454 -0.0527256 -0.268653 0.1011557 0.1343941 -0.0427397 0.1362494 0.1198713 0.0729809 -0.0229069 -0.0530961 -0.0287872 0.1144321 -0.0500147 -0.042648 -0.0497001 0.0738602 0.1042197 0.0284189 0.0255735 -0.0025054 0.1119907 -0.0743025 0.0078498 -0.0597982 0.0774852 0.0700923 0.0425627 0.0330233 0.0430164 0.094265 -0.0864312 0.0292345 -0.0849522 0.0578115 0.0273773 -0.0188355 -0.0613835 -0.0236612 0.1213872 -0.064443 -0.060838 -0.0625961 0.0655844 0.1585277 0.0365297 -0.006136 -0.0081302 0.3856626 -0.0047528 -0.0330646 -0.0036431 0.3946204 unknown
polarizability: 170.398289|-27.3635337|89.3631627|-4.4725618|33.4798733|82.4607579 unknown
InChI: InChI=1S/C8H5ClF3NO/c9-6-3-1-5(2-4-6)7(13-14)8(10,11)12/h1-4,14H
charge 0 multiplicity 1
19 atoms
Cl 4.743089 -0.709213 -0.201048
F  -1.926338 -1.806175 -0.281544
F  -3.565531 -0.254708 -0.287233
F  -2.120191 -0.357952 -2.021441
O  -1.108855 2.458832 1.343842
N  -1.936922 1.488946 0.67508
C  0.196823 0.228473 0.029715
C  -1.256988 0.508069 0.099168
C  0.720622 -0.626581 -0.987343
C  1.10914 0.788179 0.974565
C  -2.219289 -0.452963 -0.598596
C  2.097208 -0.909036 -1.063193
C  2.486295 0.498874 0.912083
C  2.965242 -0.343164 -0.109302
H  0.062823 -1.070384 -1.738401
H  0.741688 1.446728 1.761307
H  2.486857 -1.559478 -1.850942
H  3.174691 0.927515 1.645829
H  -1.776064 3.122437 1.660555
