program: Gaussian 09
title: 000103436
version: EM64L-G09RevD.01
frameworkgroup: C1[X(C7H8ClNO2S2)]
method: RPBEPBE
basis: SDD
operation: Freq
keyword: #p
keyword: freq=noraman
keyword: PBEPBE/SDD
title: #p freq=noraman PBEPBE/SDD
converged: YES YES NO NO
title: Mulliken charges:
elementType: Cl S S O O N C C C C C C C H H H H H H H H
charge: -0.284741 0.981744 0.456801 -0.518249 -0.494811 -0.555911 -0.063485 -0.253907 -0.225619 -0.203450 -0.197893 -0.552661 -0.212796 0.291787 0.295800 0.263902 0.260015 0.274297 0.246217 0.250213 0.242747
chargesum: 0.00000
title: Mulliken charges with hydrogens summed into heavy atoms:
elementType: Cl S S O O N C C C C C C C
charge: -0.284741 0.981744 0.456801 -0.518249 -0.494811 -0.555911 -0.063485 0.037880 0.070181 0.042767 0.052320 0.245553 0.029950
polarizability: 1.76659404e+02 -3.38022194e+00 1.72662228e+02 1.20828223e+01 -1.12908900e+01 1.06702929e+02
1716.lowfreq: -15.6116 -10.5306 0.0028 0.0034 0.0034 8.8648 20.4290 43.1567 52.0510
frequency: 15.2913 43.0378 52.0041 81.1499 91.8304 125.5714 150.0934 168.0649 170.1456 182.4390 242.3351 267.2743 299.4424 336.9017 355.0573 371.9053 402.4317 404.7824 433.4057 495.9226 599.4810 651.3559 685.7358 707.8303 758.3885 812.5487 844.5501 933.5285 955.1582 973.3869 983.6842 1004.8854 1007.1234 1041.1172 1075.0615 1080.7502 1116.3802 1151.0724 1174.6805 1182.4447 1307.3791 1382.7345 1410.3025 1437.5542 1449.2876 1452.7203 1459.5927 1571.5489 1599.9766 2971.9734 3073.9002 3100.4985 3141.7412 3152.4730 3161.7279 3170.6269 3180.2295
redmass: 6.5529 8.4434 4.5817 6.7620 5.2182 8.0240 3.8273 7.3498 1.6175 3.1111 8.8317 5.1969 7.0677 13.8630 8.3038 9.5672 3.0034 4.6068 10.9466 4.5525 6.4927 7.0879 2.4513 6.7313 1.3956 16.2637 1.2454 1.3415 17.1132 6.0370 1.4115 4.6743 1.3454 2.0387 1.4644 1.5689 1.7651 3.2240 1.0627 1.1170 1.2904 8.3247 1.1320 2.2508 1.8223 1.0897 1.0461 5.7428 6.8619 1.0330 1.0993 1.1021 1.0862 1.0891 1.0930 1.0972 1.1010
irintensity: 2.4141 0.8679 0.9656 2.9536 7.3270 1.4894 1.4630 7.0070 1.4715 1.1452 7.5593 1.0798 2.5522 66.6510 7.9507 7.7826 2.3481 15.0255 78.9982 71.5310 0.0528 2.3112 29.7097 15.7403 61.3580 100.2004 1.1893 1.1055 52.6687 4.7022 0.2165 0.4590 0.3539 20.7036 14.1086 4.7760 3.3125 58.5251 0.6880 4.6822 4.9557 6.2728 10.2778 18.3309 22.6929 15.4882 13.5021 2.0476 0.5250 10.6154 8.6203 1.1493 1.9778 7.2372 2.7005 6.1966 16.6108
temp: 298.150 k
press: 1.00000 atm
elementType: 17 16 16 8 8 7 6 6 6 6 6 6 6 1 1 1 1 1 1 1 1
symmnumber: 1
zpe: 367567.7 jmol-1
zpe.correction: 0.139999 hartree
zpe.thermalcorrener: 0.154872 hartree
zpe.thermalcorrenthalpy: 0.155817 hartree
zpe.thermalcorrgfe: 0.095441 hartree
zpe.sumelectzpe: -1731.764402 hartree
zpe.sumelectthermal: -1731.749528 hartree
zpe.sumelectthermalent: -1731.748584 hartree
zpe.sumelectthermalfe: -1731.808960 hartree
dipole: 3.3945 1.2896 3.6683
dipole: 5.1615
quadrupole: -84.5491 -110.4160 -97.1335
quadrupole: 10.3527 -0.3711 -8.7312
quadrupole: 12.8171 -13.0498 0.2327 10.3527 -0.3711 -8.7312
hfenergy: -1731.9044008 hartree
pointgroup: C01 [X(C7H8Cl1N1O2S2)]
dipole: -1.4497973 0.7021109 -1.2364843 debye
dipolederiv: -0.2228419 0.3221988 0.0752087 -0.1130729 -0.7773069 -0.2257886 -0.0627069 -0.0867016 -0.2896309 1.4330019 0.0593986 -0.0223116 -0.1054074 1.4919271 -0.0436596 -0.3476597 -0.3905461 0.952232 -0.1484336 -0.3738185 0.1023108 -0.3880447 0.78059 0.3276573 -0.0711773 0.2710552 0.2684049 -0.692404 -0.1044225 0.0112039 -0.1172492 -0.7771452 -0.0470289 -0.0309498 -0.1585906 -0.4782253 -0.5244544 0.0617809 -0.0124398 0.0921678 -0.4723424 0.0458961 0.1944082 0.2967759 -0.5568654 0.3302923 0.4039033 -0.2325733 0.7424828 -0.4913825 -0.171638 0.2119994 -0.0378513 -0.344908 -0.0302581 -0.0548536 0.0147794 -0.2219549 -0.253449 0.0579288 0.06394 0.1034756 -0.1001226 -0.1717721 -0.0890036 -0.071043 0.1987413 -0.0489853 0.0687916 0.2315488 -0.013682 -0.0821513 -0.201109 0.0669245 0.1190085 -0.0100817 -0.0425366 -0.0523892 -0.1559039 0.0160814 -0.0642928 0.0061971 0.0458343 0.1653272 0.0096033 -0.0911297 0.0164231 0.0604599 0.0484048 -0.0003943 -0.1013528 -0.0510141 -0.0669039 0.0162665 0.030971 0.1566476 0.0179493 0.0982725 0.0055602 -0.1418018 -0.3625036 0.0878978 -0.1512971 0.1333237 0.043875 -0.0586866 0.0226278 0.1989443 0.0880856 -0.132287 0.025757 -0.1114449 -0.008146 0.0503247 0.0288317 0.041759 -0.0446661 0.1703013 0.0571512 0.0256369 -0.0085469 0.082908 -0.0640127 0.0147134 -0.030833 0.0979541 0.0742445 -0.0079191 -0.0664952 -0.0190229 0.0949004 -0.0071484 -0.038271 -0.0022956 0.1203882 -0.022434 -0.0027001 0.0700394 -0.0709862 0.0889444 0.0405269 0.0858912 0.0610845 0.0140413 0.0342863 0.0799065 -0.0473046 0.092007 0.0035217 0.0401664 0.0022505 -0.0772715 0.0134953 0.1287144 -0.0418161 -0.0707227 -0.034572 0.0175099 -0.0516509 -0.034935 0.0035412 0.092386 -0.0226356 0.0034065 -0.0942351 0.027832 0.1168209 -0.0517875 -0.1054938 -0.051205 0.0375302 0.0598293 0.025241 -0.0037113 0.0706151 0.0467465 -0.1080192 0.0000312 -0.0918267 0.040336 -0.0454555 0.0945926 -0.0094292 0.101965 0.07426 -0.0251146 -0.0062397 -0.0222746 0.1199841 unknown
polarizability: 176.1353387|1.7455628|159.8990409|8.6036793|30.2734989|119.9901815 unknown
InChI: InChI=1S/C7H8NO2S2.Cl/c1-8(11)12(9,10)7-5-3-2-4-6-7;/h2-6H,1H3;
charge 0 multiplicity 1
21 atoms
Cl 1.831464 2.976503 0.693214
S  0.658113 -1.285591 0.149128
S  2.996256 0.880316 0.371434
O  0.481636 -2.494955 -0.929301
O  1.203948 -1.491427 1.661119
N  2.113677 -0.047606 -0.673855
C  -0.946614 -0.287343 0.188828
C  -1.903625 -0.562109 -0.802625
C  -1.104688 0.668494 1.20618
C  -3.107222 0.179471 -0.762857
C  -2.315166 1.398569 1.221194
C  1.875731 0.193263 -2.105368
C  -3.307773 1.15562 0.241979
H  -1.722694 -1.337686 -1.553877
H  -0.324773 0.839569 1.953675
H  2.837389 0.406703 -2.60207
H  1.189717 1.049172 -2.257744
H  1.440986 -0.724227 -2.538775
H  -3.882637 -0.009241 -1.512235
H  -2.475178 2.15584 1.994953
H  -4.241547 1.727463 0.263502
