program: Gaussian 09
title: 000008995
version: EM64L-G09RevD.01
frameworkgroup: C1[X(C11H14N2)]
method: RPBEPBE
basis: SDD
operation: Freq
keyword: #pfreq=noraman
keyword: PBEPBE/SDD
title: #p freq=noraman PBEPBE/SDD
converged: YES YES NO NO
title: Mulliken charges:
elementType: N N C C C C C C C C C C C H H H H H H H H H H H H H H
charge: -0.156379 -0.015694 -0.451831 -0.393268 0.457449 -0.425358 -0.659561 -0.372550 -0.360017 -0.235665 -0.240305 -0.268586 -0.149558 0.247203 0.248332 0.217436 0.225365 0.281364 0.253642 0.241164 0.219127 0.215927 0.227472 0.224045 0.220374 0.221869 0.228003
chargesum: 0.00000
title: Mulliken charges with hydrogens summed into heavy atoms:
elementType: N N C C C C C C C C C C C
charge: -0.156379 -0.015694 0.043703 0.049533 0.457449 0.109648 0.016657 -0.145079 -0.135972 -0.015291 -0.018436 -0.040582 -0.149558
polarizability: 1.77796542e+02 -6.66616255e+00 1.37316000e+02 1.00029970e+01 9.68690027e+00 7.77121759e+01
1716.lowfreq: -14.4695 -7.4255 -0.0005 -0.0001 0.0003 5.5426 33.6046 46.7166 60.3779
frequency: 33.2394 46.4416 60.3718 90.4721 115.6461 155.8423 186.7742 213.9200 272.4034 286.8876 368.0822 385.2434 395.6374 420.9491 465.8336 505.0604 529.6298 571.4408 614.4454 692.1063 728.8729 753.3907 772.5968 788.9037 808.1652 866.1861 894.3526 940.8707 954.8661 974.5474 976.0604 983.7125 1000.1113 1030.9905 1049.3812 1078.2668 1093.7169 1126.5729 1173.4947 1185.7803 1204.5419 1222.4716 1272.5004 1275.8131 1295.7373 1336.8769 1346.4288 1355.5715 1380.4500 1384.3232 1390.6005 1447.7824 1451.5634 1465.2153 1479.2169 1490.5276 1496.2160 1510.9923 1578.1780 1620.4082 2192.1109 2983.9279 2988.7613 3002.2898 3012.5395 3037.0705 3054.7256 3077.1905 3080.0603 3094.1637 3123.6706 3129.5315 3152.5752 3159.2158 3171.2980
redmass: 4.8231 4.7174 3.6495 2.8578 2.9232 6.0302 2.2966 1.3080 3.9064 2.6675 3.0454 3.5467 3.1271 2.9908 5.3464 2.7952 2.9826 4.2281 6.3673 1.7804 4.2186 1.9109 1.2040 1.1760 1.2562 1.4877 2.3990 4.6906 1.3695 3.7687 1.4495 4.6550 3.1356 2.2316 1.7741 1.9648 1.6966 1.6973 1.0725 1.6880 1.1197 1.8237 1.3709 1.3102 1.1967 1.3424 1.3047 1.3098 5.1062 1.2872 1.7688 1.4823 1.5307 1.0527 1.0601 1.0970 1.8618 1.2965 5.9972 6.0624 12.4119 1.0360 1.0602 1.0599 1.0598 1.1024 1.1013 1.1047 1.0999 1.1007 1.0846 1.0885 1.0918 1.0937 1.1001
irintensity: 1.7361 3.5121 0.1121 0.1381 2.8846 8.6808 0.2008 0.3444 1.0440 0.5836 0.9265 7.0176 0.8312 0.0175 15.1448 9.9954 0.5236 6.2494 0.3025 41.4221 2.4301 83.5685 7.4578 16.1167 0.1778 4.9177 3.0120 1.3412 0.0534 2.1465 0.3157 11.6090 25.2259 17.8850 15.9841 12.2433 0.3515 21.5623 0.3394 37.9345 7.8921 49.5723 36.8387 20.6389 10.4615 1.5522 30.6717 87.9316 5.5239 23.0266 37.1319 6.4903 8.0538 9.2608 1.6822 30.5003 103.3484 72.2113 11.6979 176.8419 28.8007 27.4868 45.0195 4.3040 24.7439 13.6221 1.7681 18.2333 41.2858 40.4303 9.5223 7.6171 38.1529 39.7848 5.5058
temp: 298.150 k
press: 1.00000 atm
elementType: 7 7 6 6 6 6 6 6 6 6 6 6 6 1 1 1 1 1 1 1 1 1 1 1 1 1 1
symmnumber: 1
zpe: 591289.1 jmol-1
zpe.correction: 0.225210 hartree
zpe.thermalcorrener: 0.238203 hartree
zpe.thermalcorrenthalpy: 0.239147 hartree
zpe.thermalcorrgfe: 0.184450 hartree
zpe.sumelectzpe: -536.084456 hartree
zpe.sumelectthermal: -536.071463 hartree
zpe.sumelectthermalent: -536.070519 hartree
zpe.sumelectthermalfe: -536.125216 hartree
dipole: 2.4261 2.9511 1.0347
dipole: 3.9580
quadrupole: -99.8683 -73.1190 -80.0428
quadrupole: -9.3439 -1.9336 1.7407
quadrupole: -15.5249 11.2244 4.3005 -9.3439 -1.9336 1.7407
hfenergy: -536.3096662 hartree
pointgroup: C01 [X(C11H14N2)]
dipole: -0.9593193 1.1616609 -0.3937703 debye
polarizability: 177.6433275|6.7718844|137.659688|10.5393833|-8.7267975|77.5217023 unknown
InChI: InChI=1S/C11H14N2/c1-2-13(10-6-9-12)11-7-4-3-5-8-11/h3-5,7-8H,2,6,10H2,1H3
charge 0 multiplicity 1
27 atoms
N  0.280128 0.90555 0.017106
N  4.662757 -1.340334 0.188872
C  1.565888 0.379204 0.473429
C  0.246744 2.315827 -0.422299
C  -0.879374 0.101692 0.011231
C  2.321999 -0.396191 -0.663372
C  -0.181935 3.303574 0.688743
C  -2.153097 0.639815 -0.35659
C  -0.828349 -1.283621 0.368776
C  -3.305175 -0.171445 -0.371854
C  -1.992221 -2.078743 0.356596
C  -3.243298 -1.538146 -0.016503
C  3.616582 -0.927754 -0.212512
H  2.200107 1.218145 0.810066
H  1.435386 -0.286393 1.345484
H  1.259346 2.585509 -0.778102
H  -0.419812 2.413891 -1.299571
H  1.688807 -1.226883 -1.025243
H  2.486854 0.282554 -1.521091
H  -1.191644 3.064381 1.064307
H  0.515995 3.258351 1.544188
H  -0.188775 4.340659 0.30473
H  -2.254783 1.696365 -0.619734
H  0.116412 -1.753178 0.659243
H  -4.263947 0.276554 -0.658367
H  -1.913957 -3.13528 0.638485
H  -4.142738 -2.161702 -0.027419
