program: Gaussian 09
title: 000103445
version: EM64L-G09RevD.01
frameworkgroup: C1[X(C16H23N2)]
method: RPBEPBE
basis: SDD
operation: Freq
keyword: #p
keyword: freq=noraman
keyword: PBEPBE/SDD
title: #p freq=noraman PBEPBE/SDD
converged: YES YES NO NO
title: Mulliken charges:
elementType: N N C C C C C C C C C C C C C C C C H H H H H H H H H H H H H H H H H H H H H H H
charge: -0.168741 -0.133847 -0.395162 -0.462155 -0.554901 0.485338 -0.388134 -0.359460 -0.641362 -0.285921 0.528910 -0.387737 -0.405838 0.406690 -0.335382 -0.349376 -0.640001 -0.638479 0.256077 0.263604 0.255260 0.260837 0.263696 0.265862 0.249179 0.236871 0.241239 0.234326 0.231549 0.247314 0.239732 0.229045 0.239497 0.256588 0.259551 0.253312 0.240210 0.253423 0.239301 0.254401 0.254684
chargesum: 1.00000
title: Mulliken charges with hydrogens summed into heavy atoms:
elementType: N N C C C C C C C C C C C C C C C C
charge: -0.168741 -0.133847 0.124519 0.053942 -0.025342 0.485338 0.097915 -0.118221 0.071828 -0.046189 0.528910 -0.158691 -0.166341 0.406690 -0.078794 -0.089826 0.106944 0.109908
polarizability: 5.23849570e+02 -7.76906296e-01 1.77558582e+02 -6.87190410e+00 -4.25853987e+00 1.04666652e+02
1716.lowfreq: -7.7283 -0.0004 0.0003 0.0006 5.7133 11.4728 32.9056 37.2069 50.3119
frequency: 32.5794 37.1701 50.1823 68.0709 79.9672 96.0932 115.2311 129.6788 155.7000 162.6124 167.3082 180.8210 189.5758 218.2686 236.5218 274.7922 288.4984 366.2808 372.0486 401.4332 424.1934 430.1878 460.9105 498.0748 514.2691 533.6002 564.7138 598.2390 628.0115 643.9355 708.6017 744.0251 758.2956 792.6746 803.9702 831.7884 841.7379 860.1613 870.1469 889.0525 930.9549 937.2408 942.2068 948.8956 969.8797 977.7554 980.5829 985.5885 1051.8637 1052.3240 1065.3014 1085.8102 1092.5973 1114.8156 1115.7970 1135.8496 1164.9455 1167.2384 1186.8265 1207.3457 1208.7889 1221.6531 1236.6206 1248.8517 1270.1807 1286.8780 1289.6069 1307.0901 1319.5145 1335.5859 1343.1999 1351.6913 1376.9515 1391.1837 1402.3334 1420.3981 1433.8264 1455.0063 1460.2260 1468.7607 1470.7294 1474.2533 1475.7043 1478.6380 1485.0471 1485.8129 1490.2077 1494.0381 1500.4429 1526.8306 1534.7679 1572.3880 1603.4320 1644.1081 2975.8254 2980.7328 2994.4465 2999.3405 3002.9771 3018.9612 3038.0608 3054.9392 3057.5061 3068.3278 3071.4056 3081.9217 3101.4217 3101.5396 3104.8313 3114.5671 3122.8003 3130.0867 3133.1935 3139.4646 3145.4104 3179.5763 3184.1622
redmass: 3.2098 3.9393 3.7677 1.8636 2.7417 3.2085 2.4586 1.1842 2.1370 2.9467 1.4210 2.3330 1.9507 1.6539 2.8844 2.9187 2.5993 2.8366 2.7620 3.6780 3.2128 2.8759 3.5286 3.5435 2.4648 3.6266 2.8640 3.1536 6.5099 2.9996 4.0416 3.5381 2.9564 1.1662 1.2891 1.7326 3.2888 2.0832 1.9001 1.5058 3.0095 2.5464 2.3718 1.2485 1.3513 2.3320 1.4034 2.8531 1.6395 2.5453 1.8590 1.8742 1.2343 1.9487 1.3520 1.6719 1.6048 1.3471 2.3237 1.2940 1.1942 1.2340 2.5912 1.5218 1.4388 1.3379 1.4215 1.4741 1.3801 1.4104 1.3162 1.6921 2.5572 2.9204 1.2501 3.4192 1.1516 1.1989 1.1304 1.0396 1.0730 1.4469 1.1066 1.0665 1.0457 1.1675 1.7124 1.1949 1.2061 4.0093 2.8472 4.2925 4.5152 6.1813 1.0364 1.0385 1.0638 1.0361 1.0664 1.0604 1.0658 1.1005 1.1033 1.1002 1.1031 1.0960 1.0995 1.0898 1.1023 1.1044 1.0984 1.0905 1.0963 1.0892 1.0880 1.0939 1.0941
irintensity: 0.1190 2.0052 0.3220 0.0840 0.3964 0.0728 0.2524 2.9620 1.1034 0.8599 0.5686 3.1838 0.7241 0.0340 0.5582 1.5124 2.2860 0.9683 1.0914 5.7399 0.8057 0.4524 2.8087 2.2207 15.5976 15.5061 13.0691 6.2639 0.9993 5.5035 21.3711 0.1955 18.8481 14.3164 0.1476 75.5940 6.7479 1.6829 11.0640 3.2362 24.6700 9.4020 2.2351 25.1193 0.8858 22.0743 12.1598 1.9837 22.9074 0.1357 12.2740 18.2158 0.0925 11.2246 0.6604 2.9476 9.9406 0.4155 28.8359 45.8727 196.5366 6.6725 16.1595 11.4344 167.8312 27.2328 283.6333 79.6352 12.0381 56.2636 16.8768 14.0385 104.4610 280.3927 16.1643 10.9316 11.7904 25.5345 23.8157 0.3043 35.5705 2.5107 9.4078 14.4781 33.5774 3.3353 10.3329 41.4813 48.3513 69.3172 123.4118 740.2116 1823.3198 33.2887 41.6444 103.8720 36.4214 12.2050 8.4458 31.8322 16.4317 0.0484 40.5909 12.3616 4.7660 4.4555 15.5535 8.9088 33.8324 15.9970 2.4662 5.2223 25.5487 1.0278 9.0768 8.4252 7.5189
temp: 298.150 k
press: 1.00000 atm
elementType: 7 7 6 6 6 6 6 6 6 6 6 6 6 6 6 6 6 6 1 1 1 1 1 1 1 1 1 1 1 1 1 1 1 1 1 1 1 1 1 1 1
symmnumber: 1
zpe: 939065.5 jmol-1
zpe.correction: 0.357671 hartree
zpe.thermalcorrener: 0.376472 hartree
zpe.thermalcorrenthalpy: 0.377417 hartree
zpe.thermalcorrgfe: 0.309653 hartree
zpe.sumelectzpe: -731.441240 hartree
zpe.sumelectthermal: -731.422439 hartree
zpe.sumelectthermalent: -731.421495 hartree
zpe.sumelectthermalfe: -731.489259 hartree
dipole: 1.3393 0.4329 -0.3334
dipole: 1.4465
quadrupole: 10.4357 -83.9391 -109.9776
quadrupole: -1.8184 -2.2846 -2.0035
quadrupole: 71.5961 -22.7788 -48.8173 -1.8184 -2.2846 -2.0035
hfenergy: -731.7989115 hartree
pointgroup: C01 [X(C16H23N2)]
dipole: 0.5275155 0.1793679 -0.1159173 debye
polarizability: 523.8643598|-1.0198689|177.7643228|-6.3497129|1.8332045|104.4461212 unknown
InChI: InChI=1S/C16H23N2/c1-4-18-13-5-6-16(18)12-9-14-7-10-15(11-8-14)17(2)3/h7-12H,4-6,13H2,1-3H3
charge 1 multiplicity 1
41 atoms
N  4.016277 0.456331 -0.267877
N  -5.08711 0.322976 0.001548
C  5.313807 -0.283358 -0.307219
C  4.925257 -1.711657 0.142092
C  3.406583 -1.810679 -0.181414
C  2.935141 -0.361275 -0.189943
C  3.998368 1.935417 -0.342656
C  1.587928 0.087845 -0.155698
C  3.984763 2.59829 1.052009
C  0.502521 -0.796664 -0.120607
C  -0.89328 -0.469068 -0.093759
C  -1.403799 0.874607 -0.105987
C  -1.859861 -1.531352 -0.051534
C  -3.734209 0.063849 -0.030712
C  -2.769126 1.138258 -0.07556
C  -3.229805 -1.286525 -0.020585
C  -5.589288 1.713566 -0.014879
C  -6.062444 -0.786944 0.055826
H  6.04568 0.202118 0.360849
H  5.714947 -0.253657 -1.338945
H  5.089854 -1.825292 1.22667
H  5.516527 -2.482999 -0.374345
H  2.860585 -2.422711 0.554137
H  3.22854 -2.257515 -1.178628
H  4.897738 2.246149 -0.903039
H  3.12385 2.253809 -0.937306
H  1.401617 1.166873 -0.16035
H  3.084083 2.316512 1.624304
H  4.871941 2.310871 1.642568
H  3.994337 3.696519 0.941299
H  0.730655 -1.872396 -0.11311
H  -0.711534 1.722824 -0.139766
H  -1.505793 -2.569647 -0.042959
H  -3.108461 2.176772 -0.085345
H  -3.920028 -2.132352 0.011101
H  -5.235257 2.280395 0.866529
H  -6.688243 1.703084 0.006855
H  -5.270938 2.24564 -0.930638
H  -7.080992 -0.375022 0.091914
H  -5.91229 -1.408824 0.95793
H  -5.985841 -1.434267 -0.837872
