program: Gaussian 09
title: 000103410
version: EM64L-G09RevD.01
frameworkgroup: C1[X(C9H21N)]
method: RPBEPBE
basis: SDD
operation: Freq
keyword: #pfreq=noraman
keyword: PBEPBE/SDD
title: #p freq=noraman PBEPBE/SDD
converged: NO YES NO NO
title: Mulliken charges:
elementType: N C C C C C C C C C H H H H H H H H H H H H H H H H H H H H H
charge: -0.581232 -0.102017 -0.443028 -0.395724 0.006471 -0.015190 -0.728240 -0.739828 -0.721873 -0.717819 0.229533 0.195962 0.189382 0.189633 0.181415 0.182485 0.179948 0.261683 0.199170 0.194298 0.207642 0.232971 0.205883 0.207983 0.211650 0.222096 0.211775 0.213154 0.206849 0.249869 0.265100
chargesum: 0.00000
title: Mulliken charges with hydrogens summed into heavy atoms:
elementType: N C C C C C C C C C
charge: -0.066263 0.127516 -0.057684 -0.024675 0.188956 0.164757 -0.073089 -0.093332 -0.080144 -0.086041
polarizability: 1.23974535e+02 -7.88540943e-01 9.83009373e+01 6.63686035e-01 3.23899122e-03 9.42721668e+01
1716.lowfreq: -10.4977 -0.0008 -0.0006 -0.0005 7.1364 12.6344 35.5522 54.7001 78.7519
frequency: 35.2648 54.5959 78.7214 113.6093 133.8897 194.0500 201.8950 217.5501 234.9866 245.0578 255.2307 279.9902 331.2983 349.9362 359.9644 389.7602 414.6576 444.0767 461.6467 579.8994 669.7093 765.7012 818.2247 829.6955 848.2353 905.9738 914.1761 928.7303 943.4292 956.8465 963.1382 974.6387 1014.6576 1052.4539 1066.6238 1106.0934 1122.4078 1170.5959 1178.2315 1186.2540 1206.1370 1218.6205 1256.0352 1288.1590 1297.6210 1316.4904 1327.4472 1334.7397 1340.1925 1354.7005 1366.9698 1375.0446 1377.0530 1385.1137 1393.6074 1443.0769 1454.1343 1461.7644 1467.9963 1469.3401 1475.7736 1480.1428 1483.4168 1488.7066 1497.3826 1633.2091 2932.8479 2937.1946 2941.8292 2949.9798 2964.4785 2964.7371 2968.4591 2969.9211 2985.9423 2996.1167 3017.1512 3050.9224 3056.7675 3060.3587 3063.6842 3064.2418 3068.1290 3071.3557 3089.7028 3416.2976 3543.7003
redmass: 2.6526 3.1943 2.5208 3.0065 1.8946 1.1315 1.1856 2.6152 1.2777 1.6431 1.0652 1.2302 2.3550 2.0059 2.0921 2.1918 2.1984 2.2894 1.9438 2.0040 1.5889 3.4106 2.4648 1.9878 1.6364 1.3208 1.1755 1.5647 1.5869 1.4902 1.7060 1.7683 1.6435 2.0446 1.4296 1.9625 1.9062 2.2433 1.8160 1.7995 1.8901 1.3846 1.3247 1.2501 1.3471 1.4998 1.4662 1.4088 1.4501 1.2844 1.2398 1.3381 1.2689 1.2244 1.2136 1.0894 1.0801 1.0484 1.0440 1.0558 1.0515 1.0527 1.0511 1.0505 1.0539 1.0931 1.0657 1.0656 1.0807 1.0708 1.0356 1.0360 1.0361 1.0383 1.0886 1.0977 1.0964 1.0990 1.0995 1.0987 1.0995 1.0989 1.0987 1.0998 1.0989 1.0443 1.0964
irintensity: 0.0630 0.0799 0.2516 0.0890 0.8969 4.4648 6.9292 0.1163 0.6283 2.0875 2.9388 30.9065 2.5908 0.3529 2.4065 1.3112 2.0385 3.7219 9.0684 31.4053 236.3711 1.5081 1.2908 8.8321 2.0745 4.9918 5.4438 1.2458 7.3058 0.9402 2.8822 1.5723 0.5906 8.2554 0.2934 3.0479 1.3498 17.6528 6.9222 5.5647 7.0563 2.8762 8.8145 2.9260 2.8064 7.7991 1.1168 3.0843 5.0677 2.0303 23.8832 3.0586 16.0208 21.2787 14.5225 0.1935 2.8377 4.8724 3.3443 7.0409 7.6913 7.3417 12.3081 22.2991 15.0333 33.8993 19.3163 18.6735 22.4450 71.3055 52.9748 66.4852 22.7549 16.2053 14.3516 9.0247 97.5461 45.3747 10.8775 69.6005 44.7167 68.3931 80.2818 33.6026 24.9061 3.7925 0.8042
temp: 298.150 k
press: 1.00000 atm
elementType: 7 6 6 6 6 6 6 6 6 6 1 1 1 1 1 1 1 1 1 1 1 1 1 1 1 1 1 1 1 1 1
symmnumber: 1
zpe: 748255.7 jmol-1
zpe.correction: 0.284996 hartree
zpe.thermalcorrener: 0.298827 hartree
zpe.thermalcorrenthalpy: 0.299771 hartree
zpe.thermalcorrgfe: 0.245112 hartree
zpe.sumelectzpe: -409.436068 hartree
zpe.sumelectthermal: -409.422236 hartree
zpe.sumelectthermalent: -409.421292 hartree
zpe.sumelectthermalfe: -409.475951 hartree
dipole: -1.3524 -0.5240 -0.2519
dipole: 1.4721
quadrupole: -69.2901 -65.2246 -66.3393
quadrupole: 0.0360 -3.1275 -1.1273
quadrupole: -2.3388 1.7268 0.6120 0.0360 -3.1275 -1.1273
hfenergy: -409.7210633 hartree
pointgroup: C01 [X(C9H21N1)]
dipole: 0.5361983 -0.1583668 0.1511364 debye
polarizability: 123.8435709|1.9145023|98.2062416|0.9691353|-0.8310775|94.4978271 unknown
InChI: InChI=1S/C9H21N/c1-7(2)5-9(10)6-8(3)4/h7-9H,5-6,10H2,1-4H3
charge 0 multiplicity 1
31 atoms
N  -0.223408 -0.915451 -1.247724
C  -0.064428 -0.040661 -0.056873
C  -1.224113 -0.267395 0.946728
C  1.301114 -0.214336 0.682539
C  -2.674688 0.064829 0.481962
C  2.569679 -0.026578 -0.190905
C  -3.299027 -1.038682 -0.407719
C  -2.768364 1.444361 -0.21341
C  2.657483 1.395904 -0.796228
C  3.840819 -0.343555 0.6331
H  -0.125456 1.0031 -0.422102
H  -0.997281 0.350908 1.840166
H  -1.192377 -1.32475 1.291206
H  1.325315 -1.229127 1.136589
H  1.345799 0.509341 1.525164
H  -3.282646 0.120108 1.411846
H  2.522904 -0.756437 -1.028885
H  -2.726467 -1.134673 -1.34582
H  -4.351507 -0.79584 -0.651051
H  -3.290978 -2.018527 0.108572
H  -3.825174 1.719305 -0.390435
H  -2.259057 1.421765 -1.194036
H  -2.308183 2.243325 0.399517
H  2.66854 2.15916 0.006194
H  3.58381 1.515764 -1.388711
H  1.803543 1.621147 -1.461254
H  4.753371 -0.253978 0.014202
H  3.807037 -1.369482 1.045681
H  3.939811 0.358498 1.483848
H  -0.283168 -1.911817 -1.001206
H  0.489297 -0.757923 -1.970155
