program: Gaussian 09
title: 000103452
version: EM64L-G09RevD.01
frameworkgroup: C1[X(C14H17NO4)]
method: RPBEPBE
basis: SDD
operation: Freq
keyword: #p
keyword: freq=noraman
keyword: PBEPBE/SDD
title: #p freq=noraman PBEPBE/SDD
converged: YES YES NO NO
title: Mulliken charges:
elementType: O O O O N C C C C C C C C C C C C C C H H H H H H H H H H H H H H H H H
charge: -0.255340 -0.418735 -0.200772 -0.254158 -0.053058 -0.381095 0.412831 0.179192 -0.594088 -0.371131 -0.398016 0.179035 -0.795905 -0.230242 -0.228393 0.284268 -0.239059 -0.229142 -0.672054 0.260945 0.230952 0.275145 0.280674 0.244426 0.249534 0.298312 0.234302 0.224704 0.224026 0.226851 0.227055 0.235913 0.211749 0.235645 0.228928 0.376701
chargesum: 0.00000
title: Mulliken charges with hydrogens summed into heavy atoms:
elementType: O O O O N C C C C C C C C C C C C C C
charge: -0.255340 -0.042034 -0.200772 -0.254158 -0.053058 -0.120150 0.412831 0.179192 -0.087991 -0.090457 -0.153590 0.179035 -0.013757 -0.005538 -0.004367 0.284268 -0.012208 0.233826 0.004268
polarizability: 2.20928844e+02 6.79440038e+00 1.79197610e+02 -3.91637445e+00 2.89898756e+00 1.15749375e+02
1716.lowfreq: -5.3613 -3.4225 -0.0006 -0.0005 -0.0003 2.9371 10.2918 18.3246 31.4754
frequency: 10.0086 18.3154 31.3847 35.9465 42.8550 56.3662 60.8134 90.7930 102.1778 122.8241 136.2160 166.3555 201.8724 224.6603 246.6624 252.9068 289.0400 311.6001 333.8521 351.6366 384.0465 404.1326 441.6254 477.7290 497.8129 548.4503 554.9858 591.6215 613.8419 627.5976 643.4368 693.3530 706.2945 727.3271 754.9918 792.4805 799.2679 825.7383 855.7347 857.2957 877.4469 909.0062 920.0133 936.1658 970.6402 982.3324 990.3433 998.9031 1020.0235 1023.9304 1027.6215 1037.0874 1046.6906 1081.8803 1113.7096 1126.1714 1135.4465 1170.5445 1177.8809 1189.4778 1201.2761 1208.1105 1247.0216 1250.9493 1269.0880 1296.8208 1298.2509 1328.5046 1356.5919 1385.3682 1392.0715 1401.2637 1435.1517 1439.0032 1458.7828 1463.2149 1471.2518 1473.1822 1478.6314 1486.2274 1595.0782 1609.7192 1623.8945 1648.4368 1670.1034 2979.1454 2980.6635 2996.7397 3001.5071 3012.8392 3059.9588 3072.5618 3093.3996 3104.2741 3109.5182 3120.8148 3123.3619 3129.0126 3142.4395 3158.8090 3174.2719 3502.6732
redmass: 4.3448 5.3226 4.3551 6.5549 3.9382 3.6005 4.6570 4.4980 3.9533 2.4742 1.2778 2.7536 3.8170 4.7194 2.5050 1.6776 3.5624 5.9141 4.6904 6.3064 3.4465 2.8498 2.5262 3.3821 3.4299 3.3954 3.2114 2.7811 6.0844 2.1658 4.5245 4.0010 1.9504 5.3915 1.8937 3.4963 1.1081 4.0952 3.6247 1.3009 3.8427 2.5774 2.9469 1.6202 2.6139 1.4088 5.7996 1.3318 2.3499 2.3527 2.3004 1.7676 2.4169 1.5806 2.2814 2.3026 1.4612 1.0977 1.4303 1.7253 1.6230 1.3495 1.4851 1.6045 1.6720 1.5585 1.7132 1.3075 1.4129 5.8973 1.2909 1.2629 1.0926 2.1507 1.0579 1.0399 1.0922 1.0649 2.2478 1.0656 6.2920 6.0825 9.3303 7.5933 8.9376 1.0593 1.0602 1.0359 1.0648 1.0583 1.0955 1.1066 1.0985 1.0996 1.1028 1.0851 1.0959 1.0886 1.0938 1.0986 1.0963 1.0640
irintensity: 1.4660 0.0874 0.0636 1.7674 0.0283 0.7989 3.4116 0.4649 1.6919 0.9855 0.2970 3.1878 9.2354 0.3091 0.6855 0.9203 3.8986 6.4141 14.8945 0.3224 6.2298 0.2844 3.3155 4.9650 3.7987 9.2074 33.0538 32.5688 3.2113 94.1586 30.4284 24.8789 46.4296 7.3374 48.6048 6.0697 4.3901 2.7116 1.1693 0.3221 3.3133 18.9327 3.6406 0.8391 72.8168 0.6104 0.4642 4.3907 183.2946 64.3970 26.1414 10.2254 71.7431 26.4980 13.3788 218.3842 6.6326 3.8019 23.1783 7.1917 98.9125 32.1147 9.0517 6.1372 21.5528 135.1491 28.6569 0.2170 4.2131 2.1093 73.2171 21.7799 15.5408 12.5081 22.2845 11.4594 32.7439 2.9590 23.9701 13.7643 5.7524 8.9929 227.6305 116.5213 172.4698 0.0553 26.3759 20.1866 10.0160 17.7517 13.6586 6.8686 28.8596 12.8625 43.1746 1.5906 2.0137 4.7671 31.4053 30.2793 9.1502 18.6043
temp: 298.150 k
press: 1.00000 atm
elementType: 8 8 8 8 7 6 6 6 6 6 6 6 6 6 6 6 6 6 6 1 1 1 1 1 1 1 1 1 1 1 1 1 1 1 1 1
symmnumber: 1
zpe: 746884.6 jmol-1
zpe.correction: 0.284473 hartree
zpe.thermalcorrener: 0.304443 hartree
zpe.thermalcorrenthalpy: 0.305387 hartree
zpe.thermalcorrgfe: 0.231082 hartree
zpe.sumelectzpe: -897.911781 hartree
zpe.sumelectthermal: -897.891812 hartree
zpe.sumelectthermalent: -897.890867 hartree
zpe.sumelectthermalfe: -897.965173 hartree
dipole: -0.1922 -0.5092 -0.7241
dipole: 0.9058
quadrupole: -96.7642 -103.1813 -109.8418
quadrupole: -10.1745 2.2472 1.2557
quadrupole: 6.4982 0.0812 -6.5793 -10.1745 2.2472 1.2557
hfenergy: -898.1962542 hartree
pointgroup: C01 [X(C14H17N1O4)]
dipole: -0.0597287 0.1192534 0.3304682 debye
polarizability: 220.3290711|-8.7971297|173.7795453|-0.6831166|19.1294413|121.7672119 unknown
InChI: InChI=1S/C14H17NO4/c1-3-19-12(16)9-10(2)15-13(14(17)18)11-7-5-4-6-8-11/h4-8,13,17H,3,9H2,1-2H3
charge 0 multiplicity 1
36 atoms
O  -3.961824 -0.804248 0.229853
O  1.994458 2.670218 -0.654402
O  0.262211 1.467336 -1.63569
O  -3.882994 1.472311 0.708317
N  -0.019967 0.034409 0.88718
C  1.255931 0.705269 0.534561
C  2.33931 -0.337154 0.204443
C  -0.98993 0.711671 1.436703
C  -2.257952 -0.08523 1.759945
C  1.9764 -1.626311 -0.251503
C  3.708068 0.005984 0.322902
C  1.072108 1.608958 -0.701076
C  -1.023258 2.187015 1.798769
C  2.978442 -2.565803 -0.582694
C  4.708513 -0.935254 -0.006848
C  -3.431859 0.312102 0.865686
C  4.34583 -2.224698 -0.46201
C  -5.111433 -0.549869 -0.699435
C  -5.512666 -1.902033 -1.278027
H  1.633906 1.360425 1.345132
H  -2.559878 0.113164 2.807173
H  -2.049393 -1.157076 1.63596
H  0.913864 -1.875718 -0.318946
H  3.989853 1.008926 0.665473
H  -0.116853 2.735879 1.497867
H  -1.905925 2.654145 1.324066
H  -1.157554 2.303141 2.891715
H  2.69269 -3.564082 -0.933281
H  5.765811 -0.664714 0.092242
H  5.121165 -2.9558 -0.717955
H  -5.923583 -0.072749 -0.121615
H  -4.772527 0.162053 -1.47303
H  -6.358157 -1.772288 -1.978008
H  -4.672719 -2.358332 -1.828665
H  -5.825567 -2.597134 -0.480251
H  1.919279 3.207591 -1.489851
