program: Gaussian 09
title: 000103403
version: EM64L-G09RevD.01
frameworkgroup: C1[X(C12H14O2)]
method: RPBEPBE
basis: SDD
operation: Freq
keyword: #pfreq=noraman
keyword: PBEPBE/SDD
title: #p freq=noraman PBEPBE/SDD
converged: YES YES NO NO
title: Mulliken charges:
elementType: O O C C C C C C C C C C C C H H H H H H H H H H H H H H
charge: -0.284197 -0.262884 -0.440655 -0.339721 0.214778 -0.132396 -0.195517 -0.666906 0.203369 -0.342482 -0.336812 -0.219532 -0.217690 -0.222894 0.212001 0.208716 0.239732 0.227193 0.219323 0.241838 0.211818 0.225593 0.219155 0.269928 0.272877 0.232905 0.230710 0.231751
chargesum: 0.00000
title: Mulliken charges with hydrogens summed into heavy atoms:
elementType: O O C C C C C C C C C C C C
charge: -0.284197 -0.262884 -0.019939 0.127203 0.214778 0.086927 0.046321 -0.010341 0.203369 -0.072554 -0.063935 0.013374 0.013020 0.008857
polarizability: 2.06479648e+02 5.46630303e-01 1.37744477e+02 5.46746622e+00 3.25999987e+00 7.70475203e+01
1716.lowfreq: -7.0155 -0.0005 0.0006 0.0008 1.0512 4.5621 13.9743 33.9459 58.4491
frequency: 10.0996 33.7471 58.4246 67.2266 96.8639 138.6839 144.3325 185.3281 205.2918 232.5005 252.2141 296.9474 392.5781 403.9567 408.8437 442.1162 492.6077 498.5188 613.9999 659.8124 679.8058 702.0557 765.8967 795.2221 799.4337 815.7461 865.5541 873.1850 904.9259 955.2691 969.0372 979.8753 990.4521 996.7613 1008.3816 1018.1674 1019.7331 1052.3474 1069.2816 1086.3252 1115.5529 1152.9321 1173.5600 1181.5708 1201.0184 1237.7725 1242.3761 1280.4356 1292.8507 1314.6511 1323.2087 1360.4969 1388.5827 1389.6100 1437.6434 1464.9009 1467.6225 1475.5478 1477.8422 1485.1943 1583.8373 1611.0686 1618.1773 1689.0149 2968.2930 2980.4386 3000.8980 3030.5196 3065.0633 3068.0087 3078.3083 3086.2052 3110.6478 3129.3655 3141.9787 3154.8558 3166.8010 3178.5700
redmass: 4.1168 3.7208 4.6834 2.7833 3.3304 2.6728 3.0767 1.9913 3.1990 2.1318 2.7135 4.2191 5.6767 2.8268 2.4448 3.6502 2.5971 5.7655 6.4407 6.3912 5.0319 1.6043 1.6426 2.1687 2.4374 1.8713 1.2444 2.9249 2.6604 1.4202 1.5658 1.2427 6.2529 1.3847 1.3272 2.1337 2.5624 2.8133 1.8230 1.7212 2.7106 1.8911 1.0568 1.1261 1.2148 2.3234 1.3818 1.2479 1.2800 1.3240 1.4004 1.5010 1.2012 9.9658 2.2442 1.0746 1.0928 1.0436 2.2809 1.0628 6.9541 6.2647 9.7326 6.5159 1.0623 1.0355 1.0570 1.0966 1.1049 1.0938 1.0989 1.1010 1.0910 1.0854 1.0892 1.0940 1.0979 1.0977
irintensity: 0.2502 0.3999 2.0856 0.2053 0.8266 2.0337 0.1387 0.1462 4.4556 2.5958 6.7196 6.3923 0.7538 0.0290 4.6989 0.4865 6.8454 3.3131 0.6423 4.2386 15.0809 92.3901 8.5510 22.8227 13.7294 1.1084 0.0350 62.3843 13.8513 4.4749 8.8292 93.1858 1.1469 0.1564 0.4353 63.6001 57.8924 238.4888 1.3570 24.5097 11.8712 0.4236 0.1319 48.5993 2.2021 279.4811 80.1067 5.6786 0.7776 3.4698 9.8096 6.8899 8.5648 2.5038 16.5994 8.2998 12.2626 11.6175 5.2808 11.7576 49.8388 15.1544 165.8445 9.6216 36.9296 37.3985 20.2559 7.3887 6.3368 9.9622 68.5819 48.3398 27.2272 0.2352 12.0486 16.2763 22.0704 8.5997
temp: 298.150 k
press: 1.00000 atm
elementType: 8 8 6 6 6 6 6 6 6 6 6 6 6 6 1 1 1 1 1 1 1 1 1 1 1 1 1 1
symmnumber: 1
zpe: 598772.7 jmol-1
zpe.correction: 0.228060 hartree
zpe.thermalcorrener: 0.242201 hartree
zpe.thermalcorrenthalpy: 0.243145 hartree
zpe.thermalcorrgfe: 0.184033 hartree
zpe.sumelectzpe: -615.077560 hartree
zpe.sumelectthermal: -615.063420 hartree
zpe.sumelectthermalent: -615.062475 hartree
zpe.sumelectthermalfe: -615.121588 hartree
dipole: -1.0947 2.2653 0.1432
dipole: 2.5200
quadrupole: -63.3815 -85.2176 -84.2577
quadrupole: 4.6027 0.6214 0.8727
quadrupole: 14.2375 -7.5987 -6.6388 4.6027 0.6214 0.8727
hfenergy: -615.3056206 hartree
pointgroup: C01 [X(C12H14O2)]
dipole: 0.3983896 0.9067881 -0.0447662 debye
polarizability: 206.1489447|2.031455|137.8213208|8.1876021|-2.775892|77.3013802 unknown
InChI: InChI=1S/C12H14O2/c1-2-3-7-10-14-12(13)11-8-5-4-6-9-11/h3-9H,2,10H2,1H3
charge 0 multiplicity 1
28 atoms
O  0.449939 -0.444964 -0.042067
O  -0.809131 -2.406874 0.083904
C  5.117627 0.666032 -0.326629
C  1.701283 -1.277318 0.008198
C  -1.940305 -0.246325 -0.054184
C  3.942905 -0.137256 0.186803
C  2.826223 -0.440518 -0.525279
C  5.403454 1.913066 0.550122
C  -0.756001 -1.15315 0.003466
C  -3.231533 -0.834779 -0.024492
C  -1.805874 1.164277 -0.13458
C  -4.379938 -0.018571 -0.07622
C  -2.958369 1.976623 -0.186044
C  -4.245519 1.388348 -0.157263
H  4.933137 0.974207 -1.373219
H  6.024105 0.025622 -0.33784
H  1.516514 -2.187154 -0.5933
H  1.869133 -1.580141 1.05761
H  4.019233 -0.489113 1.229272
H  2.719175 -0.088724 -1.560877
H  5.608094 1.623324 1.597706
H  4.537701 2.598966 0.552125
H  6.28297 2.466022 0.173209
H  -3.308972 -1.925292 0.03861
H  -0.804692 1.603565 -0.154426
H  -5.375781 -0.474145 -0.05346
H  -2.855622 3.06551 -0.247736
H  -5.138457 2.022462 -0.197108
