program: Gaussian 09
title: 000103401
version: EM64L-G09RevD.01
frameworkgroup: C1[X(C13H15N)]
method: RPBEPBE
basis: SDD
operation: Freq
keyword: #pfreq=noraman
keyword: PBEPBE/SDD
title: #p freq=noraman PBEPBE/SDD
converged: YES YES NO NO
title: Mulliken charges:
elementType: N C C C C C C C C C C C C C H H H H H H H H H H H H H H H
charge: -0.013081 -0.222657 0.556393 -0.367300 -0.714513 -0.580302 -0.447373 0.415648 -0.692254 -0.080762 -0.307127 -0.336932 -0.185280 -0.370688 0.203689 0.199673 0.197248 0.228749 0.213824 0.210467 0.234811 0.236644 0.214694 0.205367 0.232090 0.258347 0.244147 0.227766 0.238712
chargesum: 0.00000
title: Mulliken charges with hydrogens summed into heavy atoms:
elementType: N C C C C C C C C C C C C C
charge: -0.013081 -0.018968 0.556393 0.029622 -0.061473 -0.345492 -0.210730 0.415648 -0.040103 -0.080762 -0.048780 -0.092785 0.042486 -0.131976
polarizability: 2.15038570e+02 9.94676606e+00 1.41423118e+02 -1.16330654e+01 -4.74019708e+00 8.89675648e+01
1716.lowfreq: -13.4177 -9.2407 -4.7896 -0.0006 -0.0004 0.0006 19.2585 55.5153 106.0594
frequency: 18.6672 55.4785 106.0177 154.7895 166.6327 176.4868 212.9663 230.3435 239.9139 314.7281 359.8693 400.1077 423.5430 444.3698 479.2210 508.2446 528.0264 556.4153 611.2037 670.6812 675.2548 751.7182 782.2654 793.6149 809.9241 836.7458 853.7387 885.8228 900.7306 935.4481 940.0524 961.3245 981.4974 987.4645 999.9110 1026.4166 1028.4385 1081.6144 1098.0826 1117.4123 1126.9717 1155.3646 1185.9279 1225.1460 1236.6681 1252.5853 1261.1513 1289.2703 1327.0808 1334.8473 1349.1078 1371.9979 1387.0024 1389.7634 1403.2997 1423.2189 1456.7921 1464.0362 1474.4242 1476.6239 1477.6234 1484.1325 1498.0355 1553.1178 1587.8249 1629.7266 2968.9700 2975.6343 2976.4952 2978.1575 3024.0660 3069.6903 3072.0656 3079.7564 3080.6006 3108.8107 3119.5840 3123.4749 3126.6575 3163.9162 3164.5724
redmass: 3.4695 3.3912 2.2590 2.4851 3.1324 3.3581 1.1427 2.2535 1.3500 3.7366 3.3779 3.4430 3.3783 3.5211 2.9259 3.6085 5.3992 3.5803 6.9321 2.5776 3.2292 5.1536 1.3986 1.3974 2.1165 2.1064 1.6762 3.6269 1.5728 3.4351 1.4891 1.2601 1.3729 1.3748 1.6596 2.5044 2.5962 1.6577 2.5475 1.6804 1.7462 1.4157 1.6370 1.8027 1.9549 1.4511 1.5354 1.2538 1.5531 1.6076 3.8434 1.6950 1.2009 1.2194 2.8822 2.5956 2.8658 1.0711 1.0502 1.0433 1.0915 1.0677 3.6024 6.9053 5.7641 6.7051 1.0691 1.0628 1.0364 1.0455 1.1009 1.0997 1.0992 1.1001 1.0998 1.0909 1.0884 1.0890 1.0911 1.0984 1.0960
irintensity: 0.3519 0.0138 0.1622 0.1389 1.6920 3.4634 0.0888 0.5436 0.0566 0.5287 1.7220 2.7941 1.5766 0.2033 9.3228 0.6114 0.3151 4.9839 4.5111 1.7781 1.3325 1.8922 12.0848 20.6774 7.7235 7.7849 46.9558 4.4227 24.3927 3.3885 1.0098 5.7459 0.0382 2.7067 12.6843 0.5945 3.9740 3.9278 3.3893 11.5050 2.9554 0.5336 4.6676 0.3516 4.9242 3.3501 0.7339 1.9176 0.1329 5.9765 8.9737 8.2658 1.5471 23.8532 4.8698 0.3495 1.2171 2.9504 9.6114 15.4697 2.5294 8.0544 43.5943 8.1393 12.1918 3.9959 10.9312 18.9664 67.2411 25.7076 29.5864 14.6353 76.3550 25.4610 80.2181 17.2732 14.3844 13.6159 19.1403 39.3269 2.7164
temp: 298.150 k
press: 1.00000 atm
elementType: 7 6 6 6 6 6 6 6 6 6 6 6 6 6 1 1 1 1 1 1 1 1 1 1 1 1 1 1 1
symmnumber: 1
zpe: 639759.1 jmol-1
zpe.correction: 0.243671 hartree
zpe.thermalcorrener: 0.256438 hartree
zpe.thermalcorrenthalpy: 0.257382 hartree
zpe.thermalcorrgfe: 0.203706 hartree
zpe.sumelectzpe: -558.129622 hartree
zpe.sumelectthermal: -558.116856 hartree
zpe.sumelectthermalent: -558.115912 hartree
zpe.sumelectthermalfe: -558.169588 hartree
dipole: 1.8422 -2.1161 0.0301
dipole: 2.8058
quadrupole: -78.8148 -79.4990 -87.8637
quadrupole: 8.2314 -2.0167 -1.5199
quadrupole: 3.2443 2.5602 -5.8045 8.2314 -2.0167 -1.5199
hfenergy: -558.3732935 hartree
pointgroup: C01 [X(C13H15N1)]
dipole: -0.7233605 0.8294589 -0.0856643 debye
polarizability: 215.2586695|11.1074832|141.7240206|9.255837|-1.9878918|88.4465623 unknown
InChI: InChI=1S/C13H15N/c1-3-10(2)11-6-7-13-12(9-11)5-4-8-14-13/h4-10H,3H2,1-2H3
charge 0 multiplicity 1
29 atoms
N  2.900544 -1.0442 0.149624
C  -2.781375 -0.076962 -0.471534
C  -1.274796 -0.292358 -0.299669
C  -3.403197 0.72802 0.708209
C  -3.100484 0.605499 -1.828967
C  -0.381584 0.7868 -0.246728
C  -0.744328 -1.623893 -0.198154
C  1.026057 0.583867 -0.096725
C  -3.287378 0.020223 2.074611
C  1.544294 -0.767368 0.003202
C  0.624127 -1.860497 -0.051263
C  1.973174 1.659557 -0.039702
C  3.331111 1.372314 0.10654
C  3.746459 0.002704 0.197111
H  -3.263694 -1.076427 -0.475287
H  -4.471287 0.91243 0.475111
H  -2.919809 1.724617 0.761186
H  -2.681415 0.031571 -2.674745
H  -4.193566 0.689684 -1.974148
H  -2.674768 1.625533 -1.870485
H  -0.755101 1.816613 -0.321866
H  -1.440952 -2.470323 -0.237878
H  -3.755254 0.621376 2.875515
H  -3.791407 -0.964826 2.054432
H  -2.230712 -0.148762 2.349624
H  1.032071 -2.87307 0.026577
H  1.620105 2.695281 -0.111992
H  4.08093 2.168321 0.153203
H  4.809933 -0.240625 0.312496
