program: Gaussian 09
title: 000103399
version: EM64L-G09RevD.01
frameworkgroup: C1[X(C10H16O3)]
method: RPBEPBE
basis: SDD
operation: Freq
keyword: #pfreq=noraman
keyword: PBEPBE/SDD
title: #p freq=noraman PBEPBE/SDD
converged: YES YES NO NO
title: Mulliken charges:
elementType: O O O C C C C C C C C C C H H H H H H H H H H H H H H H H
charge: -0.278394 -0.421641 -0.225502 0.402114 -0.252559 -0.464474 -0.771733 -0.469570 0.190783 -0.300547 0.373940 -0.781638 -0.790111 0.245316 0.219770 0.237343 0.225986 0.281383 0.219502 0.217045 0.209431 0.217145 0.383067 0.217492 0.216947 0.228434 0.221674 0.226199 0.222594
chargesum: 0.00000
title: Mulliken charges with hydrogens summed into heavy atoms:
elementType: O O O C C C C C C C C C C
charge: -0.278394 -0.038573 -0.225502 0.402114 -0.007243 -0.007360 -0.044861 -0.043095 0.190783 -0.083402 0.373940 -0.118765 -0.119643
polarizability: 1.48354165e+02 3.95135768e+00 1.23025700e+02 7.61450202e+00 2.96873027e+00 8.70101106e+01
1716.lowfreq: -9.0742 0.0006 0.0008 0.0010 3.3495 9.5059 20.5200 30.9305 49.9954
frequency: 20.2275 30.8521 49.9606 59.2453 86.4038 121.6158 130.7279 168.3201 188.2883 195.5246 216.5663 281.0937 301.9931 319.5821 352.0428 380.9744 412.9983 427.7692 448.3801 475.8459 537.9257 596.1489 604.5858 672.6698 712.4216 749.4067 774.4662 804.1743 839.2780 862.1528 922.6447 946.6398 963.3417 992.3793 1008.1736 1018.4236 1027.4747 1039.9050 1065.2424 1079.6117 1081.9713 1125.1734 1139.8194 1221.2603 1230.9826 1255.1186 1263.0604 1272.8248 1328.0636 1334.3417 1360.4735 1387.8421 1393.8404 1397.9202 1398.9457 1454.9800 1457.9720 1466.8664 1471.9890 1472.0681 1473.7954 1480.8646 1483.7703 1666.6494 1697.0212 2958.6187 2965.2183 2969.5892 2988.4572 2991.8457 3030.1986 3032.8330 3034.0358 3059.7488 3071.6804 3077.5938 3081.5025 3094.0861 3115.2828 3117.4692 3517.2827
redmass: 3.0021 4.3276 3.1717 7.5984 2.6159 1.4832 1.5732 2.1819 1.2302 1.4503 3.7173 2.2849 3.4535 4.6191 2.7291 2.4821 4.6090 2.7290 3.2765 2.5645 2.9383 1.4741 4.0425 3.1580 4.8571 1.5698 4.3235 1.8765 1.5524 4.2185 4.0733 1.3949 1.6718 1.2495 2.0125 3.2029 1.8346 1.6704 1.5914 1.5694 1.6608 2.0278 1.5180 2.1307 1.5645 1.4341 1.4395 1.9871 1.4702 1.8125 1.4386 1.3040 2.4472 1.2896 1.2353 1.0532 1.0708 1.0649 1.0525 1.0939 1.0741 1.0766 1.0730 8.5897 6.4647 1.0373 1.0399 1.0618 1.0609 1.0385 1.0971 1.0932 1.0963 1.0994 1.0935 1.0981 1.0969 1.0958 1.0945 1.0935 1.0641
irintensity: 0.1741 0.3239 0.5712 1.1603 0.8898 0.7592 0.1222 2.1600 1.2168 0.3391 0.5219 1.0237 3.0450 0.5780 3.1550 4.3337 6.9275 3.0187 12.5898 8.8858 8.3646 112.0153 26.4842 57.5982 27.7507 2.7321 6.7168 2.6415 14.6600 15.1369 18.0913 0.6871 0.5731 4.7509 116.2531 12.4686 53.8321 130.9618 9.5161 38.6822 4.5168 11.7290 4.2935 2.6034 17.1474 2.4624 8.4625 19.7604 6.9827 3.8341 3.0582 17.9362 119.2482 43.0620 10.1715 1.8634 2.3754 9.7059 23.3518 1.7327 6.8476 11.5084 25.1486 206.7716 3.6784 36.5943 55.2383 20.7112 22.1467 20.7486 3.0013 4.5833 50.9831 17.0199 23.7695 20.4514 54.6014 40.0639 2.9653 11.1137 36.4772
temp: 298.150 k
press: 1.00000 atm
elementType: 8 8 8 6 6 6 6 6 6 6 6 6 6 1 1 1 1 1 1 1 1 1 1 1 1 1 1 1 1
symmnumber: 1
zpe: 629884.9 jmol-1
zpe.correction: 0.239910 hartree
zpe.thermalcorrener: 0.255379 hartree
zpe.thermalcorrenthalpy: 0.256323 hartree
zpe.thermalcorrgfe: 0.195296 hartree
zpe.sumelectzpe: -615.259446 hartree
zpe.sumelectthermal: -615.243978 hartree
zpe.sumelectthermalent: -615.243034 hartree
zpe.sumelectthermalfe: -615.304061 hartree
dipole: 2.9150 1.5914 -1.6102
dipole: 3.6909
quadrupole: -84.7470 -72.9650 -81.9683
quadrupole: -7.7099 5.1960 1.4402
quadrupole: -4.8535 6.9284 -2.0749 -7.7099 5.1960 1.4402
hfenergy: -615.4993566 hartree
pointgroup: C01 [X(C10H16O3)]
dipole: 1.1376404 0.6745219 -0.5995281 debye
polarizability: 147.7169628|4.6019875|123.2119642|8.8397135|3.8918491|87.4610479 unknown
InChI: InChI=1S/C10H16O3/c1-7(2)5-4-6-10(3)8(13-10)9(11)12/h5,8,11H,4,6H2,1-3H3
charge 0 multiplicity 1
29 atoms
O  -2.036193 -1.104421 1.334167
O  -2.952294 2.148345 -0.163739
O  -4.039196 0.13063 -0.57182
C  -1.135732 -1.060346 0.113443
C  -1.856989 0.190442 0.596387
C  0.354471 -1.147614 0.436917
C  -1.645723 -1.85612 -1.07445
C  1.250418 -0.449484 -0.627306
C  -3.063056 0.747677 -0.095394
C  2.722838 -0.575625 -0.29148
C  3.6161 0.421036 -0.024521
C  5.064956 0.096395 0.307045
C  3.289599 1.904532 -0.029869
H  -1.266484 0.945097 1.129968
H  0.638951 -2.215624 0.51701
H  0.539477 -0.692901 1.427541
H  -1.379922 -2.920944 -0.946151
H  -2.739773 -1.773433 -1.165335
H  -1.18462 -1.500574 -2.013973
H  0.948615 0.609991 -0.719543
H  1.063875 -0.917794 -1.615761
H  3.094003 -1.612533 -0.251017
H  -3.744969 2.514345 -0.642417
H  5.340005 0.486439 1.30737
H  5.754933 0.572556 -0.417941
H  5.255553 -0.99079 0.298641
H  3.529683 2.357815 0.952359
H  2.231988 2.118854 -0.252958
H  3.908087 2.435648 -0.780572
