program: Gaussian 09
title: 000103390
version: EM64L-G09RevD.01
frameworkgroup: C1[X(C11H18O2)]
method: RPBEPBE
basis: SDD
operation: Freq
keyword: #pfreq=noraman
keyword: PBEPBE/SDD
title: #p freq=noraman PBEPBE/SDD
converged: YES YES NO NO
title: Mulliken charges:
elementType: O O C C C C C C C C C C C H H H H H H H H H H H H H H H H H H
charge: -0.276263 -0.272864 -0.478233 -0.249202 -0.162872 -0.439845 -0.154261 -0.669168 0.451397 -0.472922 0.250955 -0.778250 -0.801984 0.198266 0.222393 0.224866 0.226778 0.221417 0.206525 0.202300 0.218274 0.213811 0.225689 0.209639 0.250316 0.227478 0.237494 0.227373 0.302641 0.218872 0.219382
chargesum: 0.00000
title: Mulliken charges with hydrogens summed into heavy atoms:
elementType: O O C C C C C C C C C C C
charge: -0.276263 -0.272864 -0.057574 0.202441 0.058545 -0.031020 0.064013 -0.020029 0.451397 -0.222606 0.250955 -0.085904 -0.061090
polarizability: 1.61148872e+02 -9.80727153e+00 1.41083130e+02 -9.21242254e+00 -6.71845034e+00 9.66694261e+01
1716.lowfreq: -8.9634 -0.0007 -0.0004 0.0006 2.9227 7.6561 15.1108 26.0627 31.5999
frequency: 14.8866 26.0420 31.4470 63.0168 89.2152 95.6230 108.2467 118.8840 152.8006 177.0700 185.9539 230.8700 245.0745 260.5786 284.0000 346.1684 371.1528 398.0768 453.4396 457.4039 465.2720 480.5879 692.5338 722.0289 767.6371 783.0028 818.9760 846.9907 873.8653 883.9743 898.0764 939.6106 958.6137 971.4746 979.7219 987.5776 1020.7443 1052.8116 1068.0478 1069.3937 1087.9475 1106.8537 1120.3326 1146.2093 1199.4932 1227.8243 1237.6320 1244.1880 1279.2770 1293.7570 1316.9745 1346.3640 1351.8569 1368.0743 1385.1822 1388.6080 1396.7268 1445.9534 1450.6591 1456.5751 1464.4845 1467.7647 1472.8751 1474.4635 1484.6960 1487.4922 1607.9767 1663.2902 1692.0444 2964.1176 2965.0689 2966.0762 2969.8629 2977.4714 2999.5898 3025.1265 3035.2166 3040.9282 3042.1436 3063.0650 3066.9037 3072.6601 3077.4312 3084.2878 3092.0790 3124.9353 3143.6741
redmass: 3.9193 3.5105 2.4947 3.7626 3.1337 1.0682 2.8285 3.0288 1.5954 1.3427 2.2995 1.6000 3.0129 2.4297 3.1673 2.8579 4.3957 2.4575 3.1112 3.0053 2.3058 2.1357 3.9275 5.6330 1.2637 2.0057 2.4397 3.0365 1.4668 1.7549 2.0520 2.0581 2.0728 1.2330 2.1026 1.2333 1.9131 2.1448 1.9759 2.0102 1.7333 2.2093 2.0636 1.9230 1.3481 1.1947 3.0274 1.2035 1.2364 1.2611 1.4091 1.3750 1.5020 1.4679 1.2023 1.3719 1.2238 1.0951 1.0697 1.0498 1.0745 1.1019 1.0823 1.0428 1.0638 1.0466 9.2669 5.8843 6.6213 1.0618 1.0384 1.0637 1.0386 1.0355 1.0581 1.0971 1.0957 1.0957 1.0955 1.1008 1.0981 1.0980 1.0913 1.1004 1.0990 1.0974 1.0906
irintensity: 0.1313 0.5744 0.5535 2.5966 1.7304 0.1561 0.4051 1.2721 1.2026 0.3089 0.9011 0.4414 3.4550 7.0187 2.6540 1.2852 2.3018 2.0386 8.6801 1.1318 9.9973 4.2848 2.0804 3.9957 5.3823 3.7027 0.8357 0.0156 23.2569 2.4710 7.5075 35.4017 11.0872 83.9552 6.6392 7.7089 7.7897 10.5983 147.8089 195.2199 7.0774 35.0303 175.0688 2.7386 0.3920 1.8903 79.5936 1.6811 2.1177 0.7502 1.1183 22.9116 1.2476 10.2836 7.4289 45.1597 23.0162 16.4136 30.7939 6.7518 7.5692 51.2148 8.3151 10.5095 12.2790 28.4886 163.7697 173.6977 0.3795 44.3416 7.6341 35.5676 51.3214 35.6644 39.6897 10.6688 4.9374 9.2565 33.8677 11.0133 11.7686 2.7990 122.8610 59.9468 24.4631 1.9015 7.0084
temp: 298.150 k
press: 1.00000 atm
elementType: 8 8 6 6 6 6 6 6 6 6 6 6 6 1 1 1 1 1 1 1 1 1 1 1 1 1 1 1 1 1 1
symmnumber: 1
zpe: 692441.1 jmol-1
zpe.correction: 0.263737 hartree
zpe.thermalcorrener: 0.280056 hartree
zpe.thermalcorrenthalpy: 0.281000 hartree
zpe.thermalcorrgfe: 0.216891 hartree
zpe.sumelectzpe: -579.362146 hartree
zpe.sumelectthermal: -579.345827 hartree
zpe.sumelectthermalent: -579.344882 hartree
zpe.sumelectthermalfe: -579.408992 hartree
dipole: 0.0215 1.7012 -0.7986
dipole: 1.8794
quadrupole: -71.6131 -76.9476 -79.4730
quadrupole: -8.3238 2.2424 1.5475
quadrupole: 4.3981 -0.9364 -3.4618 -8.3238 2.2424 1.5475
hfenergy: -579.6258828 hartree
pointgroup: C01 [X(C11H18O2)]
dipole: -0.0167576 0.6467416 -0.3580257 debye
polarizability: 161.3070539|-10.0263431|139.4401937|-9.6485935|-9.6369599|98.1541804 unknown
InChI: InChI=1S/C11H18O2/c1-4-5-6-7-8-13-11(12)9-10(2)3/h5-6,9H,4,7-8H2,1-3H3
charge 0 multiplicity 1
31 atoms
O  -0.086572 -0.900025 -0.368683
O  -1.813012 -1.663674 1.003463
C  2.157023 -1.846063 -0.44241
C  0.722515 -2.072818 0.056096
C  2.874004 -0.718017 0.271284
C  4.110234 1.512734 0.373609
C  3.40011 0.377184 -0.334206
C  3.410258 2.878343 0.147085
C  -3.294033 0.852795 -0.017562
C  -2.031746 0.413627 -0.325298
C  -1.374366 -0.802343 0.193217
C  -3.818046 2.132233 -0.641655
C  -4.248053 0.149334 0.924149
H  2.703712 -2.800097 -0.284181
H  2.139497 -1.660748 -1.532456
H  0.274431 -2.981904 -0.387323
H  0.669664 -2.165977 1.156629
H  2.959773 -0.815164 1.36605
H  4.16902 1.297853 1.457995
H  5.155098 1.585141 0.005857
H  3.294837 0.479152 -1.426891
H  3.959463 3.694539 0.651786
H  2.378252 2.85797 0.54049
H  3.355945 3.121108 -0.930738
H  -1.413336 0.992847 -1.019977
H  -4.742982 1.932881 -1.217886
H  -3.082864 2.603258 -1.315241
H  -4.0912 2.863586 0.144345
H  -3.815173 -0.770476 1.341484
H  -5.188703 -0.098144 0.39305
H  -4.528849 0.827865 1.754118
