program: Gaussian 09
title: 000103435
version: EM64L-G09RevD.01
frameworkgroup: C1[X(C17H18BrN3)]
method: RPBEPBE
basis: SDD
operation: Freq
keyword: #p
keyword: freq=noraman
keyword: PBEPBE/SDD
title: #p freq=noraman PBEPBE/SDD
converged: YES YES NO NO
title: Mulliken charges:
elementType: Br N N N C C C C C C C C C C C C C C C C C H H H H H H H H H H H H H H H H H H
charge: 0.017501 -0.059890 -0.008462 -0.005248 0.187218 -0.476926 -0.463067 0.406905 0.066300 -0.239067 -0.347495 -0.411209 -0.296177 -0.625325 -0.624081 -0.197043 -0.188573 -0.197254 -0.232192 -0.378940 -0.169373 0.236224 0.221836 0.257226 0.239051 0.260405 0.259749 0.257680 0.227083 0.182655 0.224841 0.235919 0.222991 0.184011 0.253470 0.251634 0.242021 0.249652 0.235946
chargesum: 0.00000
title: Mulliken charges with hydrogens summed into heavy atoms:
elementType: Br N N N C C C C C C C C C C C C C C C C C
charge: 0.017501 -0.059890 -0.008462 -0.005248 0.187218 -0.018865 0.033210 0.406905 0.066300 -0.239067 -0.087089 -0.151460 -0.038497 0.009255 0.018840 0.056427 0.063061 0.044767 -0.232192 -0.129287 0.066573
polarizability: 2.61232814e+02 1.72328787e+01 1.96858026e+02 1.46239282e+01 6.15831998e+00 1.77461369e+02
1716.lowfreq: -4.4946 -1.7767 -0.0004 -0.0004 -0.0002 9.8289 26.5672 27.8163 32.4062
frequency: 26.5495 27.7770 32.2278 42.2036 50.3833 55.2669 90.3128 113.7002 118.1888 138.6590 154.8165 185.8690 192.8315 210.5724 232.9083 236.7910 249.1216 294.8595 318.6278 342.0201 346.4873 398.6901 404.2764 405.4100 410.8011 420.9419 455.0575 472.0270 505.3458 536.8747 611.6203 623.2940 643.0646 671.1513 712.0979 722.3605 753.4885 776.7458 795.0488 804.2762 826.1916 835.7229 883.3484 906.8814 924.2147 960.4484 961.1424 965.7118 975.9838 994.2325 1005.5124 1020.2807 1030.7546 1043.0998 1045.4974 1050.9607 1065.3405 1073.0240 1090.8850 1095.4587 1122.3232 1138.0269 1155.7339 1167.4451 1181.7388 1197.1428 1221.7891 1274.6540 1281.2139 1287.2908 1294.8734 1301.9222 1314.5270 1340.8415 1361.8071 1363.6634 1389.9742 1409.0799 1421.7347 1434.2809 1448.2826 1451.8315 1455.7680 1463.0489 1471.7403 1475.3667 1482.8315 1497.2529 1562.9739 1577.9007 1578.5176 1593.9911 2192.9387 2841.4445 2855.2866 2984.9682 2993.4745 3005.3191 3009.5999 3040.6416 3063.8102 3068.5213 3074.6572 3134.6364 3137.4726 3141.2146 3152.7250 3155.9669 3170.5040 3173.9639 3174.2851
redmass: 3.3184 3.7651 5.5434 4.7012 4.0436 4.8568 4.3709 6.9886 6.5666 4.3426 4.2427 4.2677 5.6054 1.3080 2.2543 1.1096 3.7922 5.5085 4.5451 3.3566 5.8090 3.0926 2.8713 3.2543 2.3895 4.5333 6.4214 4.6568 3.2545 3.5529 7.1889 6.9787 4.6100 6.4768 5.5985 3.9474 1.7382 1.2832 2.3598 3.6569 1.5419 1.2962 4.1018 1.3232 2.8471 1.6362 3.9631 1.4669 1.3778 5.2907 1.3440 4.2067 3.1979 2.5134 1.4595 2.3041 2.6241 2.3281 1.2773 1.7807 1.4232 1.4346 1.8540 1.0926 3.5905 1.1233 3.1569 1.5344 1.7677 1.7922 1.7236 1.2754 7.8518 1.3630 2.5766 1.6817 3.1953 1.8923 1.1338 1.1155 1.7930 1.2068 1.0512 1.1078 1.4989 1.3948 1.0511 1.0567 5.9343 5.8805 7.0193 6.0050 12.6619 1.0576 1.0580 1.0583 1.0590 1.0708 1.0717 1.1016 1.1038 1.1023 1.1006 1.0872 1.0900 1.0899 1.0880 1.0950 1.0954 1.1015 1.0968
irintensity: 0.2664 0.5011 0.3599 1.3041 0.9349 0.3044 0.4349 1.4877 1.4543 0.5239 1.8323 3.3136 0.0636 1.5933 1.3000 0.4032 0.5792 2.2763 0.2512 17.4180 6.2430 1.7235 1.0532 3.5011 0.3480 1.8277 13.8566 1.6848 10.6977 17.2579 3.9371 1.7841 14.1899 2.3053 26.0985 6.0773 37.1883 8.7313 19.4480 14.7669 44.9390 10.4616 1.3711 0.2414 0.9532 1.4111 2.3437 1.0230 0.0890 84.6442 0.0583 6.3071 1.8972 23.1843 11.6896 48.3520 28.0175 1.4928 11.3913 2.7429 4.3871 4.0098 20.1268 1.3236 0.1152 1.7640 5.9408 2.6402 1.9242 5.3506 13.1202 0.8784 0.9351 4.8663 4.6938 8.4728 9.9158 22.0375 6.9158 10.8405 38.9352 5.4975 13.0231 57.7476 28.9345 45.3071 6.9378 14.5723 11.8173 32.5898 7.5085 15.3177 4.0620 70.0753 152.4387 5.2949 38.3800 54.9727 63.8036 0.3946 10.5128 58.7542 42.9967 9.0650 2.8574 3.5880 3.8222 20.7254 6.6611 21.7019 1.2190
temp: 298.150 k
press: 1.00000 atm
elementType: 35 7 7 7 6 6 6 6 6 6 6 6 6 6 6 6 6 6 6 6 6 1 1 1 1 1 1 1 1 1 1 1 1 1 1 1 1 1 1
symmnumber: 1
zpe: 810041.9 jmol-1
zpe.correction: 0.308529 hartree
zpe.thermalcorrener: 0.329402 hartree
zpe.thermalcorrenthalpy: 0.330347 hartree
zpe.thermalcorrgfe: 0.255734 hartree
zpe.sumelectzpe: -834.754448 hartree
zpe.sumelectthermal: -834.733574 hartree
zpe.sumelectthermalent: -834.732630 hartree
zpe.sumelectthermalfe: -834.807243 hartree
dipole: 0.4652 1.2133 -5.8058
dipole: 5.9494
quadrupole: -145.2459 -116.5444 -144.3134
quadrupole: 2.5782 -11.6008 0.3224
quadrupole: -9.8780 18.8235 -8.9455 2.5782 -11.6008 0.3224
hfenergy: -835.0629765 hartree
pointgroup: C01 [X(C17H18Br1N3)]
dipole: -0.2979793 -0.5096837 -2.2650046 debye
polarizability: 258.8510618|17.6545546|197.2422916|-19.1421093|-7.6037374|179.4588555 unknown
InChI: InChI=1S/C17H18BrN3/c1-21(2)12-10-17(13-19,16-5-3-4-11-20-16)14-6-8-15(18)9-7-14/h3-9,11H,10,12H2,1-2H3
charge 0 multiplicity 1
39 atoms
Br 6.021209 0.655373 -0.751084
N  -3.428673 2.245619 -0.337014
N  -1.421269 -1.981259 0.838894
N  -0.428591 0.378239 3.160035
C  -0.178903 0.151844 0.503018
C  -1.068001 1.272573 -0.147819
C  -2.579287 1.177421 0.223753
C  1.33444 0.326497 0.187581
C  -0.656438 -1.232969 -0.006802
C  -0.339797 0.234656 1.97988
C  2.266848 -0.524569 0.83541
C  1.819221 1.278356 -0.738832
C  -0.331853 -1.660397 -1.319025
C  -3.588325 2.222843 -1.798748
C  -3.198162 3.590068 0.215792
C  3.647662 -0.435894 0.568024
C  3.201974 1.381615 -1.021746
C  -0.82781 -2.900612 -1.772728
C  4.101111 0.52009 -0.365977
C  -1.889821 -3.182844 0.390463
C  -1.624524 -3.682497 -0.903372
H  -0.674121 2.255847 0.172151
H  -0.956551 1.201552 -1.246734
H  -2.682753 1.19719 1.324924
H  -2.982299 0.205078 -0.115995
H  1.912949 -1.260316 1.566843
H  1.135483 1.962039 -1.249678
H  0.306983 -1.043434 -1.959013
H  -3.835337 1.197204 -2.128688
H  -2.68658 2.561227 -2.371384
H  -4.426569 2.88364 -2.08831
H  -3.156655 3.533924 1.318188
H  -4.040421 4.251286 -0.060651
H  -2.257446 4.083057 -0.138827
H  4.354903 -1.094929 1.079188
H  3.564898 2.124534 -1.737707
H  -0.591016 -3.254797 -2.781508
H  -2.495743 -3.752088 1.104217
H  -2.024436 -4.652371 -1.214619
