program: Gaussian 09
title: 000103389
version: EM64L-G09RevD.01
frameworkgroup: C1[X(C15H26O)]
method: RPBEPBE
basis: SDD
operation: Freq
keyword: #pfreq=noraman
keyword: PBEPBE/SDD
title: #p freq=noraman PBEPBE/SDD
converged: YES YES NO NO
title: Mulliken charges:
elementType: O C C C C C C C C C C C C C C C H H H H H H H H H H H H H H H H H H H H H H H H H H
charge: -0.276376 0.222473 -0.438039 0.228232 -0.453825 -0.498918 0.202116 -0.754118 -0.770675 -0.357119 -0.829626 -0.188993 -0.075670 -0.722218 -0.203669 -0.682466 0.198223 0.199135 0.204677 0.206461 0.215178 0.214291 0.224221 0.226449 0.210167 0.217746 0.209529 0.224548 0.214740 0.222954 0.252485 0.218912 0.257415 0.183507 0.223723 0.212062 0.231727 0.175982 0.202734 0.199524 0.227206 0.225297
chargesum: 0.00000
title: Mulliken charges with hydrogens summed into heavy atoms:
elementType: O C C C C C C C C C C C C C C C
charge: -0.276376 0.222473 -0.040681 0.228232 -0.042687 -0.069449 0.202116 -0.093282 -0.118853 -0.142378 -0.135274 0.068422 0.107838 -0.054707 0.175046 -0.030440
polarizability: 2.08526990e+02 -3.40704335e+00 1.69952973e+02 5.15257811e+00 -6.98057794e+00 1.36435108e+02
1716.lowfreq: -10.7053 0.0001 0.0002 0.0005 2.7896 6.0350 23.8451 38.0173 54.9744
frequency: 23.6919 37.8211 54.8084 57.5251 93.4985 97.4583 122.4902 136.9584 173.6094 199.3821 205.0450 226.3133 235.2029 246.5341 254.8579 259.0238 269.0725 299.4378 307.1490 350.2827 363.1070 376.5261 392.1568 408.4067 418.0203 466.0078 475.9204 510.3110 522.7991 569.6837 653.1132 694.3618 785.9470 791.1435 816.0682 841.7983 848.2992 873.2740 891.2217 908.0258 926.2338 934.7488 938.9053 971.6008 982.6587 989.1870 1006.5153 1025.5718 1046.9501 1048.6391 1052.7133 1082.1265 1087.8920 1123.8258 1130.4187 1138.7665 1139.4529 1160.0979 1177.9977 1194.8098 1199.4851 1211.6548 1238.7360 1249.2545 1268.7027 1283.5406 1289.7810 1298.6956 1336.8482 1342.4131 1346.7442 1358.5817 1368.1722 1372.4153 1381.9472 1389.7640 1392.5971 1393.5211 1448.8348 1457.0087 1458.5049 1458.9053 1464.7245 1465.3391 1470.3422 1471.7246 1474.3361 1476.2536 1480.3069 1484.6216 1490.3552 1494.6367 1635.6070 1645.6987 2915.2155 2920.8526 2937.2834 2956.6975 2963.5751 2967.8731 2972.8549 2977.5212 2980.4230 2989.8513 2991.1886 2995.2651 3022.4237 3024.8180 3044.0353 3059.5601 3062.8724 3067.5279 3071.6366 3077.5925 3088.5915 3090.6387 3091.9174 3095.3227 3098.0514 3105.3287
redmass: 3.2916 3.3222 3.1475 1.8478 2.9560 2.8059 2.6490 2.5113 2.5370 1.1850 1.3136 1.4495 1.3916 1.3016 1.3141 1.9212 1.8007 1.9760 2.5398 2.3923 2.1273 3.0698 2.6199 2.8476 2.8393 3.1189 3.0293 3.2825 2.9800 2.5981 3.9223 3.3021 2.5626 2.4583 1.0912 1.6284 1.8837 2.1821 2.1785 1.8152 1.5337 2.2599 1.9757 1.1670 1.3875 1.5740 1.3423 2.0407 1.5768 2.4505 3.1395 1.6437 2.2462 1.6448 2.3320 1.7292 1.8855 2.2563 2.2015 2.3968 2.0588 2.0693 1.3643 1.1501 1.4718 1.7683 1.1804 1.3901 1.4419 1.5273 1.5013 1.7755 1.3051 1.1903 1.2344 1.2048 1.2807 1.2211 1.0903 1.0715 1.0479 1.0419 1.0602 1.0635 1.0775 1.0538 1.0509 1.0776 1.0481 1.0543 1.0618 1.0783 7.0957 6.2604 1.0776 1.0655 1.0629 1.0397 1.0582 1.0359 1.0371 1.1011 1.0768 1.0349 1.0358 1.0801 1.0964 1.0982 1.1030 1.0972 1.0943 1.0953 1.0991 1.0976 1.0990 1.0961 1.0997 1.1001 1.1009 1.0902
irintensity: 0.1816 0.0246 0.3339 0.6180 0.3296 0.8582 4.2036 1.6988 1.4365 0.9940 0.9501 0.4461 0.1603 1.7920 0.1581 0.4257 2.1848 0.2339 0.0571 2.7904 3.2483 0.6686 3.3234 3.9326 0.8475 3.0124 2.1450 5.9949 1.8431 0.1529 6.9166 4.8694 1.9797 3.7919 2.7869 0.6057 1.9394 1.5207 0.3421 6.6118 0.8311 37.6751 2.0442 27.6829 8.2270 7.4448 2.5547 10.3574 10.9749 7.4387 147.3772 2.5489 2.1189 1.0640 5.0452 4.9669 22.8457 36.3486 3.4357 1.7386 2.6011 3.0478 7.8805 4.1276 3.8358 6.1778 16.2269 5.7208 3.6648 2.3856 8.3764 8.9154 5.7671 17.7603 18.2731 19.7914 19.6976 8.5015 8.2636 4.3428 3.5237 14.6162 1.3705 14.6004 4.5938 8.7543 3.9301 19.1977 8.3835 8.7637 7.0919 9.4748 16.2631 2.2214 19.4360 86.8569 37.5592 60.1354 34.7261 23.0542 39.1596 55.8290 17.6902 26.2272 27.9036 55.6555 27.2518 52.8312 61.4748 1.8843 48.1671 57.4727 19.8107 58.5914 33.5182 18.8614 31.7884 32.3114 41.9412 20.3537
temp: 298.150 k
press: 1.00000 atm
elementType: 8 6 6 6 6 6 6 6 6 6 6 6 6 6 6 6 1 1 1 1 1 1 1 1 1 1 1 1 1 1 1 1 1 1 1 1 1 1 1 1 1 1
symmnumber: 1
zpe: 978452.2 jmol-1
zpe.correction: 0.372673 hartree
zpe.thermalcorrener: 0.391957 hartree
zpe.thermalcorrenthalpy: 0.392901 hartree
zpe.thermalcorrgfe: 0.325107 hartree
zpe.sumelectzpe: -661.094210 hartree
zpe.sumelectthermal: -661.074926 hartree
zpe.sumelectthermalent: -661.073982 hartree
zpe.sumelectthermalfe: -661.141776 hartree
dipole: -1.7594 -0.5458 0.4704
dipole: 1.9012
quadrupole: -104.4674 -97.3052 -99.7787
quadrupole: -3.2254 3.3973 -0.8072
quadrupole: -3.9503 3.2119 0.7384 -3.2254 3.3973 -0.8072
hfenergy: -661.4668831 hartree
pointgroup: C01 [X(C15H26O1)]
dipole: -0.7005502 -0.1778344 0.1926377 debye
polarizability: 208.1575869|-5.4478088|170.3622344|4.0870855|-7.2981641|136.3952498 unknown
InChI: InChI=1S/C15H26O/c1-6-16-13(3)9-10-14-12(2)8-7-11-15(14,4)5/h9-10,13H,6-8,11H2,1-5H3
charge 0 multiplicity 1
42 atoms
O  3.643256 -0.090454 -0.319253
C  -1.940708 -1.051891 0.475091
C  -3.46152 -0.864159 0.199336
C  -1.157817 0.27325 0.248232
C  -3.737826 -0.040111 -1.06953
C  -3.159002 1.373294 -0.884147
C  -1.736491 1.381944 -0.332407
C  -1.362369 -2.155106 -0.461507
C  -1.800328 -1.536699 1.950323
C  0.255394 0.249964 0.704702
C  -1.063933 2.739479 -0.457514
C  1.344044 0.753205 0.053641
C  2.757027 0.679302 0.593441
C  3.417733 2.060879 0.7144
C  3.308175 -1.521691 -0.395644
C  4.358452 -2.185314 -1.287081
H  -3.921865 -0.344665 1.065379
H  -3.935027 -1.863743 0.135224
H  -4.824599 0.013054 -1.271935
H  -3.270299 -0.525117 -1.948275
H  -3.811614 1.961489 -0.201652
H  -3.166906 1.926237 -1.846446
H  -1.517398 -1.901856 -1.525814
H  -0.274525 -2.274773 -0.303324
H  -1.849407 -3.128697 -0.26041
H  -2.501861 -2.373253 2.130545
H  -0.785612 -1.90895 2.178653
H  -2.044492 -0.727223 2.663019
H  0.450719 -0.266284 1.658241
H  -0.712848 2.926238 -1.492686
H  -0.197335 2.849174 0.2139
H  -1.79516 3.539791 -0.227512
H  1.241393 1.220019 -0.936062
H  2.744027 0.175231 1.588235
H  3.439968 2.560965 -0.270103
H  2.85785 2.697195 1.422195
H  4.457281 1.953765 1.070123
H  3.318169 -1.961388 0.627952
H  2.287281 -1.6558 -0.812621
H  4.16031 -3.269221 -1.378086
H  4.342667 -1.73988 -2.29698
H  5.368999 -2.0459 -0.865445
