program: Gaussian 09
title: 000103393
version: EM64L-G09RevD.01
frameworkgroup: C1[X(C13H20O2)]
method: RPBEPBE
basis: SDD
operation: Freq
keyword: #pfreq=noraman
keyword: PBEPBE/SDD
title: #p freq=noraman PBEPBE/SDD
converged: YES YES NO NO
title: Mulliken charges:
elementType: O O C C C C C C C C C C C C C H H H H H H H H H H H H H H H H H H H H
charge: -0.296827 -0.241422 0.232895 -0.460339 -0.459446 -0.740224 -0.327535 0.247840 0.397940 0.281764 -0.487571 -0.787555 -0.804588 -0.661948 -0.515949 0.220296 0.281698 0.218828 0.205542 0.217507 0.231365 0.241492 0.217051 0.242088 0.242670 0.215321 0.226455 0.217437 0.248350 0.223446 0.214931 0.219405 0.215508 0.239599 0.283976
chargesum: 0.00000
title: Mulliken charges with hydrogens summed into heavy atoms:
elementType: O O C C C C C C C C C C C C C
charge: -0.296827 -0.241422 0.232895 0.041655 -0.035076 -0.049859 -0.110484 0.247840 0.397940 0.281764 -0.002814 -0.128342 -0.117861 0.012564 -0.231973
polarizability: 1.58788879e+02 1.24547678e+01 1.52057773e+02 -2.33420578e+00 1.19317445e+00 1.29688280e+02
1716.lowfreq: -21.8912 -8.8581 -6.8752 -0.0005 -0.0003 0.0004 5.7700 19.1958 27.1444
frequency: -19.4917 18.2702 26.7942 49.8381 59.5139 72.1767 93.1945 108.1872 131.7277 151.8310 170.4596 186.4933 187.4445 205.6397 226.6529 271.0615 282.7028 301.4161 328.7402 342.7870 375.0220 390.5588 425.8274 457.6714 524.4305 543.3927 552.5660 574.1667 627.6124 656.1043 670.8613 711.7862 746.9893 791.4718 794.7505 818.6319 839.2987 871.9122 927.4708 947.5829 957.9861 990.9044 1004.6531 1013.7773 1030.5774 1063.0763 1080.5941 1081.5446 1083.0961 1119.0812 1131.4646 1149.9944 1177.7708 1202.2331 1238.9354 1242.9104 1271.2299 1300.6438 1333.1019 1347.3722 1354.0383 1386.7513 1388.3150 1395.9058 1398.5575 1444.7952 1451.4870 1454.5546 1460.1566 1463.5127 1469.0534 1470.1417 1472.1320 1474.8266 1482.6447 1488.3442 1643.4761 1692.4240 2135.0575 2956.6965 2964.6236 2989.8778 2992.8115 2996.2202 3000.3709 3004.1125 3028.2534 3032.7310 3045.5369 3053.5911 3075.1363 3081.8087 3090.9354 3095.1875 3099.7428 3103.6902 3106.7187 3113.0910 3427.4347
redmass: 2.8292 3.0788 2.5700 2.4187 5.4784 2.9811 3.7381 1.1320 2.7504 2.8329 1.6105 1.1871 1.4791 1.6994 2.3293 3.4193 2.4051 3.1330 3.1137 3.4196 2.7079 2.8033 3.9143 2.4140 4.0612 3.1155 3.1689 3.6667 1.2287 3.9538 1.2557 4.0894 1.9186 1.3770 2.1006 2.2752 1.7390 3.2606 2.0314 1.4210 1.9236 1.2493 1.8851 1.8823 2.9947 2.2264 1.6430 1.9579 1.7266 2.2041 2.5455 2.4046 2.4567 2.4455 1.8478 1.1866 1.3090 1.2403 1.7454 1.3683 1.4329 1.2100 1.2963 1.2090 1.2365 1.0860 1.0639 1.0510 1.0574 1.0686 1.0509 1.0428 1.0640 1.0591 1.0510 1.0805 9.3851 6.3967 6.0396 1.0371 1.0391 1.0598 1.0612 1.0389 1.0645 1.0378 1.0969 1.0962 1.0963 1.0957 1.0976 1.0914 1.1005 1.0974 1.0959 1.1000 1.1004 1.1008 1.1595
irintensity: 0.2670 0.1382 0.0982 1.0198 3.5010 0.6889 1.0613 0.4102 0.2993 1.2800 0.4121 0.8488 0.6035 0.6005 2.1342 6.4922 1.9837 0.5825 3.4762 5.0623 5.0394 3.9588 0.4397 3.6127 5.1860 8.7309 1.3959 5.8454 71.3914 2.2738 56.4552 16.4827 5.8314 16.7657 0.4315 5.2934 25.6317 44.1529 5.7291 0.5181 6.6406 5.0898 37.7129 35.3560 0.3346 124.9880 4.4134 1.1176 8.1852 179.3019 49.3754 21.3041 35.5193 4.5164 7.3332 2.6983 17.7830 6.2750 35.3111 8.1584 1.9346 24.3283 20.8385 18.4392 10.9490 33.9919 7.4956 0.9986 2.2954 7.7655 20.7402 10.2473 12.5188 12.7521 18.8331 13.2114 135.8201 5.6556 0.5786 41.8850 45.9785 18.8273 19.4380 21.1470 23.6353 16.4442 9.7513 41.8687 15.7518 4.0106 8.7844 54.9688 38.8047 19.6224 28.6779 25.2720 23.3474 23.4582 65.6445
temp: 298.150 k
press: 1.00000 atm
elementType: 8 8 6 6 6 6 6 6 6 6 6 6 6 6 6 1 1 1 1 1 1 1 1 1 1 1 1 1 1 1 1 1 1 1 1
symmnumber: 1
zpe: 772002.4 jmol-1
zpe.correction: 0.294040 hartree
zpe.thermalcorrener: 0.312392 hartree
zpe.thermalcorrenthalpy: 0.313336 hartree
zpe.thermalcorrgfe: 0.246096 hartree
zpe.sumelectzpe: -656.578755 hartree
zpe.sumelectthermal: -656.560403 hartree
zpe.sumelectthermalent: -656.559459 hartree
zpe.sumelectthermalfe: -656.626698 hartree
dipole: -0.1729 -0.3426 -1.3370
dipole: 1.3909
quadrupole: -85.7742 -84.9757 -92.4158
quadrupole: -0.4767 0.6210 -2.5842
quadrupole: 1.9477 2.7462 -4.6939 -0.4767 0.6210 -2.5842
hfenergy: -656.8727948 hartree
pointgroup: C01 [X(C13H20O2)]
dipole: 0.044625 -0.1511977 0.5240401 debye
polarizability: 160.9876398|-11.5799928|150.1625999|-0.6743827|-1.2617424|129.3846916 unknown
InChI: InChI=1S/C13H20O2/c1-6-12(14)15-13(5,7-2)10-8-9-11(3)4/h2,9H,6,8,10H2,1,3-5H3
charge 0 multiplicity 1
35 atoms
O  1.599914 0.067687 0.892111
O  1.013399 1.324607 -1.002684
C  1.226478 -1.274885 0.262634
C  -0.266325 -1.294263 -0.186434
C  -1.276395 -0.786792 0.878787
C  1.524685 -2.264368 1.408909
C  -2.708452 -0.926704 0.391912
C  2.118409 -1.533706 -0.886032
C  -3.446851 0.014871 -0.264609
C  1.488051 1.25196 0.151932
C  2.047948 2.412301 0.96624
C  -4.873069 -0.276865 -0.704224
C  -2.941002 1.402073 -0.62136
C  1.602199 3.784864 0.429246
C  2.862827 -1.8131 -1.827026
H  -0.504272 -2.342406 -0.454397
H  -0.372608 -0.688654 -1.100345
H  -1.045099 0.264698 1.126252
H  -1.158661 -1.363535 1.816266
H  1.301314 -3.294072 1.081045
H  0.909113 -2.024281 2.291293
H  2.587067 -2.206318 1.695849
H  -3.174987 -1.907876 0.571059
H  1.762437 2.269942 2.024114
H  3.15262 2.324166 0.936915
H  -5.58275 0.448385 -0.257806
H  -5.194187 -1.292745 -0.414262
H  -4.976895 -0.183589 -1.803851
H  -1.890561 1.570335 -0.335528
H  -3.014663 1.568241 -1.714418
H  -3.564932 2.182354 -0.140863
H  0.509368 3.91437 0.521764
H  2.095477 4.596379 0.992777
H  1.858699 3.888876 -0.638439
H  3.501501 -2.032151 -2.662828
