program: Gaussian 09
title: 000103382
version: EM64L-G09RevD.01
frameworkgroup: C1[X(C13H16O3)]
method: RPBEPBE
basis: SDD
operation: Freq
keyword: #pfreq=noraman
keyword: PBEPBE/SDD
title: #p freq=noraman PBEPBE/SDD
converged: YES YES NO NO
title: Mulliken charges:
elementType: O O O C C C C C C C C C C C C C H H H H H H H H H H H H H H H H
charge: -0.264846 -0.409438 -0.342579 -0.561412 0.483619 -0.261049 -0.830128 -0.317236 0.053068 0.272973 0.160677 -0.733230 -0.320025 -0.339501 -0.247572 -0.186413 0.201652 0.229727 0.239608 0.236148 0.219794 0.233483 0.227489 0.209864 0.224473 0.218721 0.227348 0.269034 0.256719 0.231302 0.231653 0.386079
chargesum: 0.00000
title: Mulliken charges with hydrogens summed into heavy atoms:
elementType: O O O C C C C C C C C C C C C C
charge: -0.264846 -0.023360 -0.342579 -0.130033 0.483619 0.214706 -0.149363 -0.107372 0.053068 0.272973 0.160677 -0.062689 -0.050991 -0.082782 -0.016270 0.045240
polarizability: 1.82716132e+02 8.24401986e+00 1.80448161e+02 1.32687288e+01 -1.01229689e+01 9.54407961e+01
1716.lowfreq: -0.0007 -0.0006 -0.0002 3.2630 4.3930 10.2601 17.3405 27.0920 31.0124
frequency: 17.1689 26.7194 30.9713 76.0640 97.5159 112.2806 122.7426 135.3620 165.8374 214.3267 230.9876 255.4169 279.2576 298.9500 324.9550 383.7237 412.1106 431.6960 441.0632 486.8680 494.5748 520.6589 543.9560 554.5995 655.7017 675.2577 739.1510 755.4643 772.5046 781.2565 792.9283 830.9819 858.0804 864.3776 873.1815 917.5347 957.4499 966.6347 975.7980 989.9541 1025.6699 1033.3849 1041.1863 1043.9462 1058.4024 1067.6152 1123.6988 1126.6765 1168.8417 1191.5586 1220.4736 1226.4551 1233.8531 1253.5166 1284.0541 1339.1639 1353.2778 1366.1798 1386.2803 1394.5597 1401.8393 1408.2918 1432.0947 1444.5411 1463.5692 1466.1239 1467.1249 1470.7419 1478.3134 1483.7277 1553.5596 1582.8755 1642.3781 1698.6023 2959.4643 2964.6645 2967.7146 3007.2833 3014.9617 3031.9081 3036.3814 3045.8279 3071.2127 3081.7836 3090.9420 3097.2540 3135.9824 3154.5257 3171.8674 3179.6379
redmass: 4.7397 3.3316 3.4344 4.6712 3.8850 1.0747 2.5461 1.7394 4.1275 3.2608 2.3491 4.5616 5.0584 2.5090 4.0073 2.2864 3.6546 3.4853 5.8498 3.4216 4.1405 3.3403 3.1014 3.7098 6.5328 4.8209 2.6582 3.1155 1.4871 3.9125 3.1716 1.6492 1.1699 3.6754 1.3431 1.7313 2.1192 1.3638 1.6116 1.3253 2.2733 1.9154 1.5094 1.6536 1.8443 4.8416 2.6160 1.7878 1.0789 1.2309 1.6263 1.7163 1.2210 3.0104 2.1427 1.6682 1.3765 1.3444 2.4655 1.3821 1.2203 3.7599 2.9618 1.0955 1.0861 1.1285 1.1276 1.8699 1.0683 1.0744 4.7440 4.7192 5.1111 6.5547 1.0635 1.0404 1.0383 1.0684 1.0583 1.0966 1.0969 1.0950 1.0905 1.1065 1.0961 1.0944 1.0868 1.0902 1.0951 1.0993
irintensity: 0.9681 0.0669 0.0338 0.6061 0.7279 1.5346 1.0041 1.6705 0.6464 1.4278 1.1542 0.6704 9.4691 1.3698 3.2684 4.8769 5.7232 0.5452 4.2509 7.4104 21.7550 11.1998 7.2971 14.6808 7.8678 10.6516 4.6464 23.3496 80.6964 2.8097 14.0668 23.5949 115.5363 3.8657 9.3073 0.2823 26.5882 1.4705 6.6284 0.0711 10.5483 13.7706 0.2744 3.5013 11.3535 189.4406 14.2102 76.1007 27.5627 12.8640 250.7655 28.9499 0.8896 125.0586 271.7131 1.4925 9.7176 16.0805 111.2017 11.2511 22.7305 97.4365 7.3409 10.2818 22.4521 47.6313 8.6263 86.0708 18.5271 10.4878 52.5794 79.0375 135.5631 2.7144 31.4024 47.9223 24.2199 290.0653 33.2265 23.2037 33.8010 15.4721 4.0592 30.4922 32.6468 52.1237 5.4269 9.4454 9.7311 12.8665
temp: 298.150 k
press: 1.00000 atm
elementType: 8 8 8 6 6 6 6 6 6 6 6 6 6 6 6 6 1 1 1 1 1 1 1 1 1 1 1 1 1 1 1 1
symmnumber: 1
zpe: 681919.6 jmol-1
zpe.correction: 0.259729 hartree
zpe.thermalcorrener: 0.276071 hartree
zpe.thermalcorrenthalpy: 0.277016 hartree
zpe.thermalcorrgfe: 0.213438 hartree
zpe.sumelectzpe: -729.459656 hartree
zpe.sumelectthermal: -729.443314 hartree
zpe.sumelectthermalent: -729.442369 hartree
zpe.sumelectthermalfe: -729.505947 hartree
dipole: -2.8768 1.8095 -0.6847
dipole: 3.4669
quadrupole: -93.1194 -91.2090 -95.6119
quadrupole: 10.6001 -1.1528 1.1406
quadrupole: 0.1940 2.1045 -2.2985 10.6001 -1.1528 1.1406
hfenergy: -729.719385 hartree
pointgroup: C01 [X(C13H16O3)]
dipole: -1.1044515 0.7473317 -0.2864959 debye
polarizability: 183.7214658|8.4619279|178.7143178|11.33829|-14.2727445|96.1693052 unknown
InChI: InChI=1S/C13H16O3/c1-3-10(2)8-9-16-13(15)11-6-4-5-7-12(11)14/h3-7,14H,8-9H2,1-2H3
charge 0 multiplicity 1
32 atoms
O  -0.624376 -0.704866 -0.511055
O  3.307392 -1.764742 0.699517
O  0.82459 -2.352576 0.258249
C  -3.014447 -0.98648 -0.898372
C  -3.481759 0.068558 0.102341
C  -1.723128 -1.718645 -0.51201
C  -3.763178 -0.43684 1.506451
C  -3.632119 1.362483 -0.301658
C  1.662047 -0.106114 -0.098682
C  0.616916 -1.13882 -0.097136
C  2.989778 -0.480344 0.309275
C  -4.090651 2.551155 0.513462
C  1.400981 1.238981 -0.484744
C  4.020128 0.494401 0.316485
C  2.426936 2.196517 -0.473172
C  3.737588 1.815273 -0.071105
H  -3.792779 -1.773497 -1.002516
H  -2.880438 -0.531335 -1.896987
H  -1.77158 -2.18147 0.489269
H  -1.463861 -2.504943 -1.243888
H  -4.404356 -1.340091 1.478937
H  -2.82835 -0.72394 2.027909
H  -4.267609 0.31504 2.134205
H  -3.383656 1.591682 -1.350094
H  -4.962127 3.04192 0.03761
H  -4.373755 2.28418 1.54521
H  -3.290724 3.315542 0.573843
H  0.382897 1.503469 -0.785789
H  5.02189 0.186741 0.629312
H  2.221413 3.229442 -0.770637
H  4.541529 2.559912 -0.061169
H  2.458709 -2.330895 0.63974
