program: Gaussian 09
title: 000103375
version: EM64L-G09RevD.01
frameworkgroup: C1[X(C13H26O2)]
method: RPBEPBE
basis: SDD
operation: Freq
keyword: #pfreq=noraman
keyword: PBEPBE/SDD
title: #p freq=noraman PBEPBE/SDD
converged: YES YES NO NO
title: Mulliken charges:
elementType: O O C C C C C C C C C C C C C H H H H H H H H H H H H H H H H H H H H H H H H H H
charge: -0.276302 -0.274501 -0.386734 -0.371966 -0.383670 -0.357389 -0.372928 -0.441507 -0.381602 0.037368 -0.456659 -0.034712 -0.511177 -0.502102 -0.598825 0.196316 0.194535 0.189367 0.184056 0.191024 0.194555 0.208077 0.225857 0.190346 0.196111 0.196852 0.215580 0.193695 0.212099 0.173889 0.205087 0.198029 0.211284 0.235851 0.208657 0.197874 0.192399 0.229185 0.241880 0.212947 0.217156
chargesum: 0.00000
title: Mulliken charges with hydrogens summed into heavy atoms:
elementType: O O C C C C C C C C C C C C C
charge: -0.276302 -0.274501 0.004117 0.001456 0.001908 0.076545 0.013528 -0.029076 0.024193 0.211257 -0.053543 0.176571 0.131204 0.161362 -0.168721
polarizability: 1.95658041e+02 -7.50837623e+00 1.37367485e+02 5.79361814e+00 1.22107003e+00 1.19809021e+02
1716.lowfreq: -12.7569 -1.0810 -0.0002 0.0004 0.0010 12.1964 17.1661 23.4376 33.7070
frequency: 17.0239 21.3477 33.5351 42.9839 58.8753 65.4836 78.8560 87.8285 104.8403 115.2690 118.9733 138.5265 146.1362 154.0741 164.8715 192.4367 217.1931 256.3169 289.3885 302.9638 342.3178 384.8668 407.7780 456.4638 466.2810 506.8631 636.6368 656.8680 719.4942 726.8294 741.4239 770.3520 809.9310 840.9822 876.7034 917.3698 926.7834 939.7049 971.5579 986.9992 1002.5314 1003.6205 1006.4911 1014.0724 1039.3473 1045.9019 1058.0500 1074.2466 1079.5182 1086.4140 1109.1071 1113.0375 1116.8979 1129.9255 1152.2495 1170.1418 1174.8538 1204.5625 1208.2143 1240.6267 1241.8649 1268.7949 1272.7235 1278.0940 1282.2261 1290.2567 1291.5184 1294.7526 1307.1230 1325.8041 1336.4151 1339.0180 1350.0447 1352.8256 1366.9672 1424.6805 1427.7378 1435.2536 1448.8228 1452.1830 1456.8477 1459.6529 1461.4464 1464.0944 1465.7078 1473.9243 1478.5102 1480.5966 1483.4498 1488.3197 1657.1663 2841.5232 2926.5681 2944.7750 2945.8277 2949.5329 2951.6657 2952.3901 2960.0142 2967.1366 2979.4190 2982.5640 2988.6513 2993.9642 3002.5954 3002.7605 3014.6217 3026.6452 3031.1552 3044.2454 3057.0090 3063.4060 3069.4777 3088.7885 3098.5924 3117.7745 3192.0551
redmass: 3.8291 2.3660 2.9327 3.3442 2.0040 2.8005 2.5536 2.6628 1.9996 2.3618 1.6470 2.0138 2.0656 2.8670 1.5594 1.6307 2.4129 2.7785 3.0915 3.4624 2.9144 2.8498 2.4930 2.9549 2.5428 4.5397 1.5400 4.3516 1.0618 1.0870 1.1913 1.4224 1.8060 1.9594 1.8780 1.8104 1.5447 1.3595 4.6076 1.4361 3.2954 1.3685 2.7491 4.0654 1.9754 2.6421 2.2690 2.3800 2.1071 3.1409 1.6410 1.3867 1.4524 1.4234 1.4835 1.9177 1.8475 1.3641 1.4702 1.3386 1.3355 1.2026 1.3093 1.0592 1.1246 1.1128 1.1872 1.1371 1.3992 1.4528 1.4121 1.1880 1.5670 1.6837 1.5181 1.1782 1.1497 1.1377 1.0726 1.0522 1.0925 1.0718 1.0664 1.0734 1.0788 1.0927 1.0584 1.0561 1.0930 1.0974 4.7525 1.0825 1.0352 1.0583 1.0405 1.0588 1.0612 1.0596 1.0596 1.0606 1.0606 1.0959 1.0959 1.0642 1.0990 1.1003 1.0997 1.0992 1.1033 1.1035 1.0916 1.1036 1.0795 1.0739 1.0971 1.1027 1.1145
irintensity: 0.1579 0.0901 0.6330 0.8446 0.4932 1.7914 0.4355 2.9064 1.6206 0.7407 2.8366 0.3765 0.2433 0.5916 6.2736 0.9412 4.4042 4.2283 2.0595 2.4943 0.9277 2.7988 0.6552 0.7186 1.1243 4.2883 17.1695 2.7873 13.0960 0.1922 0.5576 13.9249 29.5461 6.8265 21.4580 2.0408 20.7982 70.4439 10.0120 8.7565 10.6838 18.9489 24.8659 122.1035 6.3984 11.5192 25.0949 1.3581 0.2140 6.5518 21.1730 4.5372 15.0860 21.1389 15.0130 36.2953 16.6945 15.8161 8.2532 2.8726 5.3976 0.9548 4.9058 1.4698 2.7123 1.1904 1.2744 0.6443 8.4841 22.5222 3.0637 31.0920 0.0927 0.1872 3.0626 3.4645 8.5683 7.4680 2.4781 10.2918 3.2684 0.6385 1.6499 9.0147 1.7718 4.6198 6.0992 12.8084 3.7170 28.1619 22.5619 100.7083 77.1604 13.8304 85.0180 3.7704 7.1215 7.2479 35.4295 133.1321 31.8082 2.2061 10.6945 38.5750 22.4858 59.8007 5.2144 24.1572 4.2988 129.9191 44.2568 90.8311 50.4451 7.7668 28.7325 25.2193 33.9533
temp: 298.150 k
press: 1.00000 atm
elementType: 8 8 6 6 6 6 6 6 6 6 6 6 6 6 6 1 1 1 1 1 1 1 1 1 1 1 1 1 1 1 1 1 1 1 1 1 1 1 1 1 1
symmnumber: 1
zpe: 957448.7 jmol-1
zpe.correction: 0.364673 hartree
zpe.thermalcorrener: 0.384898 hartree
zpe.thermalcorrenthalpy: 0.385842 hartree
zpe.thermalcorrgfe: 0.311812 hartree
zpe.sumelectzpe: -660.116816 hartree
zpe.sumelectthermal: -660.096592 hartree
zpe.sumelectthermalent: -660.095647 hartree
zpe.sumelectthermalfe: -660.169677 hartree
dipole: -2.2949 1.5618 0.9863
dipole: 2.9459
quadrupole: -86.2521 -89.9629 -97.8112
quadrupole: -4.0667 -3.3117 1.2882
quadrupole: 5.0899 1.3792 -6.4691 -4.0667 -3.3117 1.2882
hfenergy: -660.4814894 hartree
pointgroup: C01 [X(C13H26O2)]
dipole: 0.8995041 0.5969799 -0.4216954 debye
polarizability: 195.5086813|8.2855165|137.2808217|5.5467081|-2.1965207|120.0450441 unknown
InChI: InChI=1S/C13H26O2/c1-4-5-6-7-8-9-10-11-12-13(14-2)15-3/h4,13H,1,5-12H2,2-3H3
charge 0 multiplicity 1
41 atoms
O  4.790516 0.825801 0.763695
O  4.588975 -1.406154 0.044991
C  -0.57047 -0.003172 0.17185
C  0.629292 0.212794 -0.778098
C  -1.94001 0.202991 -0.513856
C  1.992832 -0.0252 -0.092743
C  -3.13837 -0.009361 0.438548
C  3.180238 0.198527 -1.053422
C  -4.507216 0.186958 -0.250755
C  4.551777 -0.045556 -0.410006
C  -5.704759 -0.028003 0.714085
C  -7.043523 0.22736 0.054734
C  5.26297 2.161795 0.406094
C  5.889058 -1.808739 0.59805
C  -8.055693 -0.67068 -0.050656
H  -0.521803 -1.029383 0.592048
H  -0.483205 0.689432 1.034937
H  0.530836 -0.468124 -1.649977
H  0.590846 1.245973 -1.185121
H  -1.987317 1.2277 -0.939024
H  -2.02732 -0.493946 -1.373557
H  2.10127 0.64737 0.780342
H  2.042182 -1.058425 0.299139
H  -3.055147 0.691997 1.295386
H  -3.087479 -1.031538 0.868537
H  3.159381 1.235238 -1.44705
H  3.093389 -0.477726 -1.926748
H  -4.561036 1.210149 -0.677839
H  -4.600104 -0.513389 -1.104788
H  5.380974 0.146944 -1.141127
H  -5.675699 -1.057999 1.120315
H  -5.58158 0.66019 1.577838
H  -7.177741 1.233235 -0.376278
H  5.534504 2.654548 1.353233
H  4.477309 2.761168 -0.098977
H  6.156804 2.117237 -0.253992
H  6.697116 -1.67759 -0.15318
H  5.789046 -2.87573 0.849656
H  6.128981 -1.221413 1.501516
H  -8.999726 -0.420309 -0.548153
H  -7.966797 -1.68477 0.359454
