program: Gaussian 09
title: 000103376
version: EM64L-G09RevD.01
frameworkgroup: C1[X(C13H20O2)]
method: RPBEPBE
basis: SDD
operation: Freq
keyword: #pfreq=noraman
keyword: PBEPBE/SDD
title: #p freq=noraman PBEPBE/SDD
converged: YES YES NO NO
title: Mulliken charges:
elementType: O O C C C C C C C C C C C C C H H H H H H H H H H H H H H H H H H H H
charge: -0.282942 -0.250731 0.041705 -0.431834 -0.446487 -0.399991 -0.395806 -0.387934 -0.067603 -0.477426 -0.580202 -0.458814 -0.252758 0.256057 -0.225169 0.230001 0.201028 0.234894 0.212291 0.206636 0.205372 0.199653 0.196881 0.205479 0.203203 0.190844 0.241837 0.240380 0.203333 0.243064 0.253532 0.217307 0.212881 0.233074 0.228245
chargesum: 0.00000
title: Mulliken charges with hydrogens summed into heavy atoms:
elementType: O O C C C C C C C C C C C C C
charge: -0.282942 -0.250731 0.271706 0.004089 -0.027560 0.005034 0.006554 0.006112 0.174235 -0.033713 -0.083606 -0.028626 -0.019684 0.256057 0.003075
polarizability: 1.82768842e+02 3.88061596e+00 1.31148766e+02 -3.54144900e+00 1.31578874e+00 1.09425451e+02
1716.lowfreq: -21.4114 -13.1783 -3.8513 0.0004 0.0006 0.0007 13.6623 26.2143 52.0074
frequency: -7.3134 24.9859 51.7774 56.1209 79.1372 98.7874 136.1292 204.4602 214.6939 219.0881 289.4432 320.1788 326.3888 340.1955 429.8750 431.5319 449.6564 488.6515 537.9476 555.8348 624.8010 670.9533 730.5956 765.6470 786.0996 792.5876 808.5264 835.1710 852.0608 869.5132 881.1752 895.2756 911.5345 922.1323 928.4050 937.6668 946.7518 991.8122 999.5843 1021.4608 1043.8145 1052.3418 1069.5426 1082.0055 1087.3727 1108.9351 1115.6400 1132.8688 1139.1680 1152.6189 1193.6145 1198.3853 1206.3986 1241.3946 1245.6879 1251.9316 1260.0165 1274.8864 1284.9058 1300.1315 1306.8411 1309.0379 1330.2601 1332.2883 1339.2316 1339.5759 1350.0361 1352.3166 1362.9822 1436.4688 1462.1784 1463.7341 1465.7084 1466.3372 1473.6208 1475.7827 1482.0602 1628.8437 1631.7888 2963.6437 2968.9600 2970.1305 2972.0424 2972.6995 2981.1733 2985.6998 2987.8572 2991.0681 3008.0684 3027.4065 3033.9524 3036.0429 3044.2389 3053.4120 3054.7281 3063.6662 3081.9602 3124.9151 3162.7756
redmass: 3.8890 3.2305 4.1204 4.6446 3.3287 2.6558 3.1097 3.4311 1.8760 3.5935 3.4490 3.3323 1.8383 2.8657 3.1408 3.3234 2.1273 1.9646 2.3058 2.9858 2.8687 3.5813 1.4771 4.9725 1.5703 2.0594 1.6849 2.7019 2.3229 3.3975 1.7717 1.6747 1.9773 1.7543 1.9722 3.5711 1.3244 2.2521 2.7600 2.0283 1.8489 1.0885 1.9601 1.3231 1.3555 2.6164 2.0166 1.7522 1.6117 2.3081 1.2998 1.4958 1.4001 1.3129 1.3934 1.2794 1.3031 1.2579 1.4620 1.2285 1.4315 1.3199 1.5260 1.3549 1.5389 1.4732 1.5608 1.7461 1.5131 1.0894 1.0872 1.0857 1.0907 1.0904 1.0828 1.0946 1.0969 7.9475 7.6217 1.0825 1.0632 1.0651 1.0627 1.0625 1.0641 1.0619 1.0645 1.0688 1.0823 1.0951 1.0957 1.0978 1.1009 1.0955 1.1020 1.1024 1.0989 1.0860 1.1062
irintensity: 0.3076 0.0725 0.4953 0.7535 0.9303 1.6462 1.2519 4.4428 0.7482 3.9325 2.7835 2.1063 1.5949 7.4100 1.8357 2.0444 1.0821 4.9860 1.4802 4.0654 10.6424 19.3006 43.2025 2.4770 1.5668 2.7137 1.6336 9.6011 1.8836 3.8976 2.1762 14.8271 8.2282 2.7451 7.2581 69.9826 0.4727 2.0653 87.7794 5.6970 0.5423 0.1928 5.8348 15.2265 21.2357 24.7104 212.2865 4.4260 147.6430 1.1949 1.2611 0.3678 29.9301 1.1603 45.2980 4.2516 0.9354 1.6571 16.7729 1.1106 8.9625 0.8670 29.1765 0.5797 1.5805 0.2689 1.5375 24.7957 0.8933 26.9501 7.9415 0.8350 7.7079 12.2851 20.8693 7.3004 3.6427 81.1704 70.4752 11.9723 58.0606 30.5954 33.4465 35.8537 13.2280 9.0470 18.8264 27.2352 22.3912 40.3016 62.4868 65.4889 38.9652 8.3085 30.9731 66.7015 32.2858 7.0676 35.1752
temp: 298.150 k
press: 1.00000 atm
elementType: 8 8 6 6 6 6 6 6 6 6 6 6 6 6 6 1 1 1 1 1 1 1 1 1 1 1 1 1 1 1 1 1 1 1 1
symmnumber: 1
zpe: 797680.9 jmol-1
zpe.correction: 0.303821 hartree
zpe.thermalcorrener: 0.317920 hartree
zpe.thermalcorrenthalpy: 0.318864 hartree
zpe.thermalcorrgfe: 0.261423 hartree
zpe.sumelectzpe: -656.652943 hartree
zpe.sumelectthermal: -656.638843 hartree
zpe.sumelectthermalent: -656.637899 hartree
zpe.sumelectthermalfe: -656.695340 hartree
dipole: -1.1943 -0.3408 -1.2519
dipole: 1.7635
quadrupole: -81.3986 -88.2680 -95.5812
quadrupole: -0.1967 -1.6066 -2.4535
quadrupole: 7.0173 0.1479 -7.1653 -0.1967 -1.6066 -2.4535
hfenergy: -656.9567632 hartree
pointgroup: C01 [X(C13H20O2)]
dipole: -0.4709923 0.0827218 -0.5026783 debye
polarizability: 182.9272446|3.892611|126.5588564|-1.8888075|8.8508343|113.8569581 unknown
InChI: InChI=1S/C13H20O2/c14-13(10-11-6-4-5-7-11)15-12-8-2-1-3-9-12/h4,6,11-12H,1-3,5,7-10H2
charge 0 multiplicity 1
35 atoms
O  -0.786136 -0.446954 -0.621446
O  0.273102 -0.297307 1.454786
C  -2.120933 -0.189708 0.024399
C  -2.342063 1.32641 0.168533
C  -3.170772 -0.849611 -0.879164
C  -3.767848 1.610156 0.705739
C  -4.597285 -0.564129 -0.344597
C  -4.847824 0.955532 -0.189231
C  2.885035 -0.412322 0.155896
C  3.095947 1.131906 0.306931
C  1.586015 -0.799429 -0.585793
C  4.62969 1.374674 0.132376
C  4.151989 -0.857059 -0.56787
C  0.331547 -0.481409 0.215443
C  5.102296 0.113428 -0.580451
H  -2.102615 -0.660071 1.027388
H  -2.216545 1.798405 -0.826376
H  -1.578738 1.752621 0.844247
H  -2.983446 -1.937826 -0.938277
H  -3.065534 -0.441409 -1.903747
H  -3.92892 2.702949 0.770437
H  -3.857578 1.213484 1.738195
H  -4.728718 -1.058054 0.640431
H  -5.344835 -1.011462 -1.026807
H  -5.854608 1.134403 0.234772
H  -4.830074 1.432791 -1.190886
H  2.841944 -0.882483 1.16116
H  2.706739 1.509128 1.266932
H  2.547849 1.652029 -0.502801
H  1.574245 -1.889889 -0.791441
H  1.522726 -0.300285 -1.569664
H  5.140919 1.478274 1.111935
H  4.850032 2.297554 -0.437009
H  4.271455 -1.865684 -0.981124
H  6.106345 0.009347 -1.006215
