program: Gaussian 09
title: 000103377
version: EM64L-G09RevD.01
frameworkgroup: C1[X(C15H24O2)]
method: RPBEPBE
basis: SDD
operation: Freq
keyword: #pfreq=noraman
keyword: PBEPBE/SDD
title: #p freq=noraman PBEPBE/SDD
converged: NO YES NO NO
title: Mulliken charges:
elementType: O O C C C C C C C C C C C C C C C H H H H H H H H H H H H H H H H H H H H H H H H
charge: -0.258194 -0.236534 0.331802 0.260229 -0.157110 -0.527276 -0.066439 -0.523193 -0.438532 0.415514 -0.828708 -0.847654 -0.463148 -0.407352 -0.747561 -0.858144 -0.000287 0.256399 0.225830 0.199090 0.228690 0.210308 0.237104 0.219376 0.203463 0.240586 0.222864 0.229914 0.226766 0.222794 0.239746 0.208918 0.223873 0.205293 0.217623 0.215145 0.234552 0.233711 0.223059 0.225320 0.202164
chargesum: 0.00000
title: Mulliken charges with hydrogens summed into heavy atoms:
elementType: O O C C C C C C C C C C C C C C C
charge: -0.258194 -0.236534 0.331802 0.260229 0.099290 -0.102357 0.162251 -0.075780 -0.015693 0.415514 -0.135344 -0.158348 -0.030357 -0.202060 -0.080241 -0.176054 0.201876
polarizability: 1.78229124e+02 -1.22687393e+00 1.57068661e+02 -1.95585255e+00 -1.07471611e+01 1.43345979e+02
1716.lowfreq: -11.5991 -0.0002 0.0003 0.0006 10.0768 18.4573 35.0219 75.2436 96.0190
frequency: 34.4152 75.2319 95.9969 132.1098 162.6915 184.4647 188.7231 204.6534 211.4925 224.6565 236.6808 257.5000 273.7352 281.7457 303.4126 319.7102 332.0968 344.6691 351.4512 366.0074 382.1570 391.4387 427.7896 464.9660 480.1487 512.3220 530.4318 570.7134 613.2261 658.6097 678.0485 718.3987 766.8701 790.4902 807.8008 824.2335 845.9631 881.7115 895.3269 921.6786 934.8906 939.6104 947.7470 959.0118 967.4577 990.3008 998.9278 1011.4344 1043.1083 1049.6981 1067.5649 1082.1005 1091.8831 1094.9635 1099.4258 1105.9289 1139.7304 1157.6466 1164.1681 1188.0907 1198.4194 1210.8772 1226.2856 1260.1340 1276.3635 1304.9888 1323.2638 1325.8445 1330.7369 1335.1008 1342.5612 1344.4262 1348.2681 1354.4708 1374.7794 1384.3275 1388.7741 1393.8159 1400.0370 1456.4588 1463.6925 1464.0480 1468.2728 1472.1920 1475.8570 1480.7419 1485.3739 1487.8666 1493.0066 1498.6912 1503.2744 1614.0682 1676.5502 2953.6116 2966.3125 2975.0805 2985.2121 2985.6840 2987.5226 2989.7040 2994.7273 2997.4342 3006.5626 3020.5752 3023.4751 3030.5959 3039.5186 3046.1418 3071.6560 3073.5493 3075.5880 3080.3568 3080.8846 3085.5459 3086.6420 3090.1052 3094.4818
redmass: 8.2212 4.2130 2.8921 2.6599 2.2382 1.2342 3.2796 2.2104 3.0842 1.7665 1.4528 1.7504 1.9236 1.9057 1.7567 1.8749 2.8995 2.1593 2.5819 2.6433 2.1069 2.7571 3.0951 3.0440 3.4736 2.9157 3.0634 3.2582 2.7684 3.7003 2.5807 3.4153 3.1272 1.7201 2.4299 2.0647 1.8220 1.9104 2.8251 2.2069 1.6308 1.9608 1.8391 1.5952 1.6803 1.9184 1.6762 1.6614 1.5387 1.5698 1.8140 1.8824 3.2149 1.9709 1.9995 2.0396 2.3711 2.4401 1.9983 2.3585 2.5386 1.5762 1.5898 1.9897 1.7749 1.3132 1.3235 1.3310 1.3692 1.6456 1.2724 1.3417 1.5064 1.3437 1.2792 1.2209 1.2205 1.2302 1.2037 1.0708 1.0752 1.0570 1.0655 1.0605 1.0612 1.0604 1.0617 1.0645 1.0601 1.0561 1.0595 8.8170 7.0172 1.0640 1.0371 1.0720 1.0601 1.0389 1.0408 1.0395 1.0633 1.0910 1.0825 1.0639 1.0909 1.1005 1.0963 1.1012 1.0999 1.0995 1.0988 1.0981 1.0983 1.0986 1.0907 1.0990 1.0989
irintensity: 1.5802 0.5865 0.1721 0.5359 0.6101 2.0234 4.3968 2.4804 2.9046 0.7473 0.0754 0.5176 1.6325 1.5696 0.8353 0.9378 6.5249 4.1583 4.2504 0.4375 0.5639 0.9136 2.2633 0.4633 7.8681 1.2444 0.4132 1.6209 0.8658 5.5648 3.5116 2.4258 2.9874 10.9450 3.6700 12.5863 9.8892 0.2167 45.5751 12.9822 2.9475 5.0929 1.2988 2.2785 2.7117 4.4855 10.6992 15.6077 11.3057 1.9539 3.4652 6.2089 178.7352 91.3951 77.8521 14.9646 3.4800 6.0325 4.7701 1.7511 0.1129 4.6344 1.3607 2.7536 2.4887 3.6386 0.3277 4.1959 4.9945 1.1732 1.0794 4.8593 3.8589 0.5074 5.8826 10.9904 6.0761 28.3431 34.0828 3.0345 1.8700 7.9164 33.4842 6.7354 20.6332 15.2366 6.7457 0.7707 5.3227 1.3121 7.1829 290.0149 2.0746 46.0307 34.1870 8.4860 39.0728 24.5249 6.9422 45.4833 35.5222 18.4505 19.2156 35.3019 65.2737 19.3018 37.5981 51.7063 15.2562 23.0878 79.3595 24.9980 1.3478 9.2212 66.8632 26.3568 41.7366
temp: 298.150 k
press: 1.00000 atm
elementType: 8 8 6 6 6 6 6 6 6 6 6 6 6 6 6 6 6 1 1 1 1 1 1 1 1 1 1 1 1 1 1 1 1 1 1 1 1 1 1 1 1
symmnumber: 1
zpe: 943147.8 jmol-1
zpe.correction: 0.359226 hartree
zpe.thermalcorrener: 0.376645 hartree
zpe.thermalcorrenthalpy: 0.377589 hartree
zpe.thermalcorrgfe: 0.316253 hartree
zpe.sumelectzpe: -735.084241 hartree
zpe.sumelectthermal: -735.066822 hartree
zpe.sumelectthermalent: -735.065878 hartree
zpe.sumelectthermalfe: -735.127214 hartree
dipole: -1.8720 0.0465 1.2532
dipole: 2.2532
quadrupole: -111.0930 -100.6151 -107.6523
quadrupole: -3.3597 7.5939 -0.2805
quadrupole: -4.6395 5.8384 -1.1988 -3.3597 7.5939 -0.2805
hfenergy: -735.4434674 hartree
pointgroup: C01 [X(C15H24O2)]
dipole: 0.7272658 0.0024491 -0.5068911 debye
polarizability: 177.9825164|2.0747259|159.2113622|-3.2116003|9.016011|141.4498857 unknown
InChI: InChI=1S/C15H24O2/c1-11-7-9-14(3)12(2)6-5-8-15(14,4)13(11)17-10-16/h6,10-11,13H,5,7-9H2,1-4H3
charge 0 multiplicity 1
41 atoms
O  -2.278855 -1.091958 -0.018334
O  -3.833186 -0.226152 1.516126
C  0.126887 -0.589013 0.221466
C  1.198573 0.579297 0.401016
C  -1.30408 0.03237 0.258394
C  0.878305 1.753573 -0.592928
C  -1.639918 1.234337 -0.66546
C  0.396273 -1.34716 -1.113693
C  -0.550974 2.32098 -0.441047
C  2.622929 0.059077 0.084044
C  0.215348 -1.611306 1.392656
C  1.173074 1.136055 1.859429
C  1.778556 -2.0303 -1.113389
C  2.854645 -1.101102 -0.593718
C  -1.850437 0.915889 -2.166232
C  3.799794 0.914056 0.53452
C  -3.473138 -1.077809 0.676838
H  -1.515912 0.361395 1.294817
H  1.035034 1.402968 -1.630439
H  1.611812 2.56702 -0.431081
H  -2.602708 1.633142 -0.286158
H  0.360116 -0.646611 -1.964845
H  -0.405338 -2.090144 -1.275461
H  -0.671923 2.769849 0.564179
H  -0.704848 3.140419 -1.169856
H  1.255601 -1.939808 1.557705
H  -0.155839 -1.180298 2.339836
H  -0.399495 -2.500912 1.167782
H  1.783362 2.053835 1.934851
H  0.152166 1.396224 2.188217
H  1.578048 0.403249 2.578438
H  2.032734 -2.356267 -2.142223
H  1.760302 -2.96018 -0.506053
H  3.897393 -1.399612 -0.77881
H  -2.39594 1.750448 -2.644246
H  -0.901188 0.78867 -2.713772
H  -2.446858 -0.00297 -2.301867
H  3.87656 0.967995 1.637181
H  3.716876 1.956766 0.170657
H  4.749648 0.500706 0.152692
H  -4.067399 -1.959722 0.367369
