program: Gaussian 09
title: 000103372
version: EM64L-G09RevD.01
frameworkgroup: C1[X(C8H11O5P)]
method: RPBEPBE
basis: SDD
operation: Freq
keyword: #p
keyword: freq=noraman
keyword: PBEPBE/SDD
title: #p freq=noraman PBEPBE/SDD
converged: YES YES NO NO
title: Mulliken charges:
elementType: P O O O O O C C C C C C C C H H H H H H H H H H H
charge: 1.398569 -0.283242 -0.528372 -0.684106 -0.674027 -0.581821 -0.278870 -0.275998 0.366137 -0.347286 -0.374196 -0.223113 -0.195829 -0.254741 0.228259 0.223740 0.258548 0.240682 0.249429 0.249548 0.225272 0.228362 0.229022 0.406599 0.397436
chargesum: 0.00000
title: Mulliken charges with hydrogens summed into heavy atoms:
elementType: P O O O O O C C C C C C C C
charge: 1.398569 -0.283242 -0.528372 -0.277507 -0.276591 -0.581821 0.173128 0.223232 0.366137 -0.097857 -0.124648 0.002158 0.032533 -0.025719
polarizability: 1.82401215e+02 3.39463809e+00 1.21000139e+02 1.48109328e+00 3.12656739e-01 7.39204024e+01
1716.lowfreq: -1.8839 -0.0008 0.0006 0.0011 5.2780 6.7996 26.7843 28.1602 50.5057
frequency: 25.6770 28.1454 50.4483 61.0619 109.6057 122.7831 134.3518 167.6560 198.9119 230.6727 244.3051 275.5733 302.0404 346.2431 354.2876 382.5146 412.5981 419.8473 472.1151 502.1179 572.2075 610.4684 641.2545 692.0130 725.9977 734.0727 759.2113 801.7542 820.2304 843.0443 892.3069 962.7496 964.8531 980.9170 983.9696 994.1451 1002.9698 1014.0099 1024.1510 1083.8635 1090.7385 1105.5901 1108.2505 1167.9495 1171.9721 1180.9047 1220.0805 1266.4843 1315.4995 1321.2872 1381.7521 1398.2450 1444.4183 1475.7986 1484.7193 1493.5617 1594.0411 1612.2487 2980.0384 3024.5093 3044.7140 3108.0514 3129.4638 3137.8900 3154.9231 3163.2471 3173.1964 3591.7416 3614.9537
redmass: 5.2594 5.1282 6.4829 6.6507 3.0419 3.6067 2.9012 1.8031 4.9609 5.0420 3.5220 2.7771 2.9990 7.5257 5.4856 1.6286 2.9279 6.5576 5.2430 2.8759 6.9484 6.4690 11.9634 2.0628 9.9216 8.6161 1.6395 6.4564 1.2252 1.1221 1.4418 1.3600 6.4816 6.1844 1.3004 7.3155 1.3494 1.2895 2.0441 1.5266 5.3499 1.5117 3.0514 1.0789 1.1149 1.1628 3.6166 1.1398 1.3249 1.2327 2.8501 2.0859 2.3497 1.7183 1.2278 1.1355 6.4533 6.2937 1.0555 1.0580 1.1070 1.1098 1.0847 1.0889 1.0924 1.0959 1.1008 1.0662 1.0666
irintensity: 1.8585 0.3733 1.1616 0.0412 2.0957 1.8155 8.9460 84.2647 15.2879 1.1740 24.9374 33.4517 10.8352 40.1053 84.2195 128.9707 0.0244 3.4471 8.6109 12.0335 13.5622 0.2718 31.4511 32.3469 249.0269 219.6208 98.3550 2.3593 0.1704 0.3183 8.4837 0.1200 157.5147 29.2338 0.6273 73.5486 27.2023 173.1742 29.0717 10.1096 202.8840 3.8970 37.2330 7.9468 3.1234 35.0917 230.4601 0.0855 1.4865 1.3696 2.6803 13.0335 4.4058 105.0595 29.5441 3.3526 28.6762 77.0296 23.9347 20.2894 22.6223 21.1676 2.8366 10.5615 31.8406 20.2293 6.8046 69.7432 74.9330
temp: 298.150 k
press: 1.00000 atm
elementType: 15 8 8 8 8 8 6 6 6 6 6 6 6 6 1 1 1 1 1 1 1 1 1 1 1
symmnumber: 1
zpe: 483897.9 jmol-1
zpe.correction: 0.184307 hartree
zpe.thermalcorrener: 0.199498 hartree
zpe.thermalcorrenthalpy: 0.200443 hartree
zpe.thermalcorrgfe: 0.139740 hartree
zpe.sumelectzpe: -1027.698516 hartree
zpe.sumelectthermal: -1027.683325 hartree
zpe.sumelectthermalent: -1027.682380 hartree
zpe.sumelectthermalfe: -1027.743083 hartree
dipole: -0.2725 -1.8322 1.4347
dipole: 2.3430
quadrupole: -82.0492 -89.9048 -88.4328
quadrupole: -15.4821 5.4236 3.2983
quadrupole: 4.7464 -3.1092 -1.6372 -15.4821 5.4236 3.2983
hfenergy: -1027.8828229 hartree
pointgroup: C01 [X(C8H11O5P1)]
dipole: 0.1181532 0.7692689 0.4939225 debye
dipolederiv: 2.5877555 0.1424814 -0.076405 -0.3256752 1.7157782 0.0868084 0.0130391 -0.0410248 1.9889876 -2.0474168 0.0332815 0.0159294 0.1694629 -0.3123456 0.0010654 -0.0036327 0.0005911 -0.2823814 -1.7450751 -0.2072977 0.0625338 -0.3600163 -0.5138049 0.0039374 0.050928 0.001189 -0.5174936 -0.6113112 -0.0489719 -0.140453 0.1031919 -0.8441173 0.2501837 -0.2694243 0.2199297 -0.8669721 -0.8311537 0.0990808 0.0419945 0.222066 -0.6205279 -0.3787067 0.1397891 -0.2796945 -0.9241557 -0.7723084 -0.0601809 -0.0044573 -0.0187829 -0.6404167 -0.0235211 0.03083 0.0068778 -0.6196545 0.8730372 0.1114079 -0.0181082 0.3572569 0.2817485 0.004935 -0.0309015 0.0044641 0.3779342 0.8016681 0.134605 -0.0152069 0.5605834 0.3162142 -0.0021417 -0.0500553 0.0039147 0.3294318 1.6619448 -0.1604126 -0.0015515 -0.5100509 0.1097567 0.0045019 0.0283665 0.0011907 0.1092032 -0.299032 0.002195 0.00076 0.3776415 -0.1019551 -0.0124138 -0.0292836 -0.0082051 -0.2116392 -0.4502988 0.0534387 -0.0012361 -0.1543067 0.0476993 -0.0176987 0.0131487 -0.0202558 -0.1866474 0.140751 0.0651463 -0.0073769 -0.0604995 0.1517987 -0.0226172 0.0027103 -0.0233568 -0.1383643 0.1647382 -0.0195142 -0.0011624 0.0085188 0.151288 -0.0234265 -0.0028667 -0.0235417 -0.1417241 -0.0414472 -0.0755281 0.0048084 -0.020172 -0.2006604 0.0002265 -0.0003049 0.0009511 -0.198351 -0.0030051 0.0208248 0.0312087 -0.0899916 -0.0394081 -0.0837712 0.0085722 -0.0963026 -0.0487006 -0.007446 0.0119635 -0.0300902 -0.0923707 -0.0105022 0.0794758 0.0102405 0.0928444 -0.0870299 0.0232917 -0.0134408 -0.0225885 -0.0622623 0.024473 0.052754 0.0086921 0.0765896 -0.0344842 0.0088418 -0.0053161 0.0295767 -0.0605799 -0.0147956 -0.0673131 0.0108779 -0.0956845 -0.0256776 -0.0061832 -0.0981016 0.0093214 -0.1228012 0.0198267 0.0134066 0.0113559 0.0124684 0.1691205 0.0906031 0.0617513 -0.0044963 0.0529858 -0.0477584 0.017197 -0.0038194 0.0175453 0.1711814 0.0567819 0.0483908 -0.0030155 0.0716963 -0.1055345 0.0202783 -0.0048019 0.0205871 0.1546568 -0.0308745 -0.1061123 0.0100324 -0.1121285 -0.0223972 0.0152157 0.0106485 0.0150318 0.1552031 -0.124632 0.0504457 -0.0014529 0.0516075 0.0743463 0.0074618 -0.0017363 0.0074226 0.1729668 0.1835186 0.0384509 0.0873299 0.0778961 0.3581499 0.0090618 0.0393088 -0.0010228 0.3724848 0.3772521 -0.0785874 0.0341055 -0.0632695 0.2231444 0.0651008 0.018319 0.1074913 0.2821052 unknown
polarizability: 182.3998664|2.7154661|120.4898662|-2.9168233|-4.6735471|74.4320232 unknown
InChI: InChI=1S/C8H11O5P/c9-14(10,11)13-7-6-12-8-4-2-1-3-5-8/h1-5,9-10H,6-7H2
charge 0 multiplicity 1
25 atoms
P  -4.231904 -0.15735 0.008046
O  0.836358 0.712471 -0.088102
O  -2.57988 -0.570154 0.021126
O  -4.237887 0.945082 -1.304227
O  -4.481097 0.974485 1.300546
O  -5.202927 -1.402402 0.012074
C  -0.220275 -0.303151 -0.006567
C  -1.528242 0.480661 -0.088148
C  2.171233 0.26306 -0.060934
C  2.550795 -1.097413 0.045446
C  3.153153 1.280268 -0.149374
C  3.926421 -1.428596 0.060769
C  4.518134 0.932544 -0.132332
C  4.914293 -0.424039 -0.027394
H  -0.147832 -1.018096 -0.848949
H  -0.160375 -0.859249 0.949393
H  -1.628979 1.008595 -1.05064
H  -1.620817 1.197642 0.746965
H  1.803262 -1.893349 0.115174
H  2.827329 2.321868 -0.230947
H  4.220624 -2.481067 0.142313
H  5.274833 1.721923 -0.201555
H  5.976225 -0.690437 -0.015095
H  -5.065212 1.474747 -1.422425
H  -4.862035 0.570958 2.122138
