program: Gaussian 09
title: 000103374
version: EM64L-G09RevD.01
frameworkgroup: C1[X(C10H19NO3)]
method: RPBEPBE
basis: SDD
operation: Freq
keyword: #p
keyword: freq=noraman
keyword: PBEPBE/SDD
title: #p freq=noraman PBEPBE/SDD
converged: YES YES NO NO
title: Mulliken charges:
elementType: O O O N C C C C C C C C C C H H H H H H H H H H H H H H H H H H H
charge: -0.482112 -0.407299 -0.252678 -0.331001 0.255621 0.254756 0.196126 -0.466553 -0.468222 -0.714941 -0.757859 -0.715840 -0.758150 0.099707 0.223136 0.217225 0.218163 0.224640 0.243754 0.263811 0.218622 0.194207 0.215903 0.238803 0.199660 0.194753 0.218645 0.264484 0.238636 0.216009 0.199587 0.366844 0.391562
chargesum: 0.00000
title: Mulliken charges with hydrogens summed into heavy atoms:
elementType: O O O N C C C C C C C C C C
charge: -0.115268 -0.015737 -0.252678 -0.087247 0.255621 0.254756 0.196126 -0.026193 -0.025419 -0.038301 -0.103492 -0.037958 -0.103918 0.099707
polarizability: 1.34086309e+02 -1.71220605e-01 1.19518746e+02 -1.41649157e+00 2.75792364e-01 1.16815286e+02
1716.lowfreq: -15.0332 -14.1987 -9.9769 -0.0005 0.0004 0.0004 14.8093 103.4298 111.0843
frequency: 13.0496 103.4126 111.0691 145.6521 148.7885 166.2848 217.0474 226.4287 236.2766 248.6298 251.6460 292.5296 300.8921 302.5998 309.2476 339.4917 350.4596 368.1134 404.4681 423.9438 451.6489 464.6689 497.2459 516.8121 526.2005 589.7711 596.3067 634.6853 700.3265 764.1946 778.4879 797.1981 868.7384 870.8105 896.5043 915.0453 932.0459 939.7864 963.0233 970.6880 997.0291 997.9079 1012.7210 1034.0670 1075.7027 1078.8878 1139.8334 1191.3303 1193.9911 1200.4366 1216.8631 1241.0706 1260.9990 1271.6397 1298.9874 1313.3531 1333.9369 1365.5371 1367.3051 1376.3165 1382.5325 1390.0141 1431.5893 1441.5042 1445.6460 1458.5006 1464.6264 1468.5081 1469.0536 1476.1957 1479.5245 1493.4977 1508.3368 1620.9960 2966.8257 2967.4912 2982.2292 2985.5743 2987.5854 2990.6770 3047.7056 3051.9966 3061.8549 3063.2100 3076.9832 3080.3857 3088.5241 3089.6242 3126.5854 3135.8353 3402.6410 3445.2285 3514.9336
redmass: 8.3460 3.2181 4.3013 2.7060 2.6987 1.0988 1.0989 1.7405 2.1814 1.3988 2.2562 1.7118 2.2875 3.3738 1.9503 4.2736 2.4356 1.6145 2.2944 2.2401 2.2665 1.7871 3.2493 2.7185 3.1215 1.2805 2.8283 3.5024 3.9837 3.5655 4.3996 3.7490 1.8613 2.2072 2.3287 2.1226 1.4691 1.4322 2.7263 1.9735 1.4701 1.6309 1.9950 1.9138 2.0513 2.0496 2.7785 2.4717 2.3682 2.5206 2.6190 2.5797 1.5825 1.6294 1.3714 1.8266 1.5532 1.2069 1.4260 1.4278 1.2095 1.2109 1.0846 1.0850 1.0833 1.0683 1.0574 1.0515 1.0740 1.0856 1.0596 1.1191 1.0526 8.8610 1.0376 1.0376 1.0545 1.0500 1.0426 1.0479 1.1028 1.1029 1.0961 1.0964 1.0979 1.0975 1.0996 1.0988 1.0993 1.0966 1.0741 1.0650 1.0642
irintensity: 3.2573 0.6382 4.3733 2.7853 0.2507 0.0215 0.3911 3.8988 1.2651 5.0035 0.8421 0.7615 16.5124 5.5634 28.3668 4.9805 0.2588 41.5695 8.4993 0.1253 0.0716 42.9439 18.0528 5.7940 7.2738 107.0199 87.9589 10.6989 36.5596 9.6256 7.7621 6.5570 2.4095 10.1832 6.9276 1.0065 3.3444 7.8254 19.7217 17.3900 1.5054 38.6752 2.0668 146.9017 9.7408 125.8265 0.4762 49.8315 30.8113 0.1699 54.8509 24.3230 40.8662 45.1421 12.7140 11.2902 16.9826 1.0433 0.9909 73.9993 35.2025 14.9697 8.6029 5.0734 4.5752 0.1144 26.0682 3.6685 0.0652 20.1264 0.2459 0.2861 17.4672 234.3035 14.0233 44.1097 7.1334 40.8320 65.1494 2.9634 8.5755 10.6007 32.6209 62.7142 30.3512 8.6656 27.7362 63.1939 5.5416 10.3249 3.7848 55.7161 34.1164
temp: 298.150 k
press: 1.00000 atm
elementType: 8 8 8 7 6 6 6 6 6 6 6 6 6 6 1 1 1 1 1 1 1 1 1 1 1 1 1 1 1 1 1 1 1
symmnumber: 1
zpe: 736891.0 jmol-1
zpe.correction: 0.280667 hartree
zpe.thermalcorrener: 0.296503 hartree
zpe.thermalcorrenthalpy: 0.297447 hartree
zpe.thermalcorrgfe: 0.238789 hartree
zpe.sumelectzpe: -671.751285 hartree
zpe.sumelectthermal: -671.735449 hartree
zpe.sumelectthermalent: -671.734505 hartree
zpe.sumelectthermalfe: -671.793163 hartree
dipole: -1.3198 0.0294 -2.8922
dipole: 3.1793
quadrupole: -87.4198 -83.3492 -86.0738
quadrupole: 0.0347 5.1304 0.1011
quadrupole: -1.8055 2.2651 -0.4596 0.0347 5.1304 0.1011
hfenergy: -672.0319519 hartree
pointgroup: C01 [X(C10H19N1O3)]
dipole: 0.5062578 0.036724 1.1432094 debye
polarizability: 134.1168408|0.127088|119.5046095|-1.2225208|-0.3336412|116.7988901 unknown
InChI: InChI=1S/C10H19NO3/c1-8(2)5-10(14,7(12)13)6-9(3,4)11-8/h11-12,14H,5-6H2,1-4H3
charge 0 multiplicity 1
33 atoms
O  0.980761 -0.076761 -1.700225
O  2.657175 -0.047177 1.572417
O  3.428561 -0.022323 -0.613162
N  -1.876979 -0.010598 0.533645
C  -1.245613 1.275362 0.093389
C  -1.264736 -1.320327 0.137791
C  0.992185 -0.045942 -0.229338
C  0.307477 1.252745 0.293983
C  0.288441 -1.31357 0.337033
C  -1.622402 1.617141 -1.372219
C  -1.832158 2.377222 1.01236
C  -1.648008 -1.708548 -1.314734
C  -1.866581 -2.380893 1.094761
C  2.468445 -0.039884 0.197045
H  0.524716 1.335858 1.376719
H  0.767098 2.121161 -0.21512
H  0.734832 -2.204715 -0.143243
H  0.506312 -1.363182 1.421436
H  -2.005108 0.007869 1.556759
H  -1.089495 0.980491 -2.092141
H  -2.710998 1.492854 -1.506171
H  -1.354551 2.667613 -1.594414
H  -1.395565 3.362257 0.76935
H  -2.926755 2.437491 0.876491
H  -1.623739 2.167221 2.08057
H  -1.405705 -2.773078 -1.495161
H  -2.73306 -1.562986 -1.455573
H  -1.098818 -1.114418 -2.058429
H  -2.961687 -2.43228 0.959523
H  -1.441952 -3.379252 0.887525
H  -1.656554 -2.135535 2.155096
H  1.928571 -0.032864 -2.009138
H  3.631086 -0.036054 1.778275
