program: Gaussian 09
title: 000103378
version: EM64L-G09RevD.01
frameworkgroup: C1[X(C12H20O2)]
method: RPBEPBE
basis: SDD
operation: Freq
keyword: #pfreq=noraman
keyword: PBEPBE/SDD
title: #p freq=noraman PBEPBE/SDD
converged: YES YES NO NO
title: Mulliken charges:
elementType: O O C C C C C C C C C C C C H H H H H H H H H H H H H H H H H H H H
charge: -0.252528 -0.170045 -0.523058 -0.473004 0.447150 -0.322119 -0.297493 -0.828191 0.427063 -0.359182 -0.802446 -0.803384 -0.246178 -0.062292 0.192506 0.218510 0.203167 0.207256 0.210441 0.228902 0.228792 0.228232 0.222079 0.192057 0.201796 0.259489 0.212710 0.207666 0.206766 0.204682 0.270281 0.208309 0.204798 0.157268
chargesum: 0.00000
title: Mulliken charges with hydrogens summed into heavy atoms:
elementType: O O C C C C C C C C C C C C
charge: -0.252528 -0.170045 -0.112041 -0.062581 0.447150 -0.111678 -0.068591 -0.149088 0.427063 0.034671 -0.122582 -0.121655 0.166929 0.094976
polarizability: 1.69336586e+02 6.84471903e+00 1.33788632e+02 -1.24234200e-01 -1.02707359e+00 1.10771595e+02
1716.lowfreq: -5.9212 -0.0005 -0.0002 0.0006 5.9665 10.6646 26.0493 46.4201 51.9755
frequency: 25.0787 46.3098 51.9315 60.8914 61.3932 69.5948 95.8389 135.5587 142.3869 158.4651 160.2529 203.0292 206.8292 233.7683 276.1388 303.4544 316.0111 355.8427 378.2759 398.1293 429.1075 471.5322 504.7895 525.4923 561.0695 684.0869 715.2677 740.8906 779.9922 827.7604 842.1184 866.8231 889.8798 925.4392 930.2266 954.3787 972.1441 982.5397 994.4431 996.6820 1037.1323 1044.9594 1055.1113 1075.2364 1087.5360 1100.2215 1130.1564 1152.3657 1179.1336 1190.8418 1195.7758 1228.8029 1236.5141 1289.8980 1304.3405 1320.4997 1353.7089 1358.8200 1381.7813 1388.4594 1389.1347 1395.7760 1398.4224 1436.2688 1452.8045 1457.9169 1461.5956 1465.5863 1471.8633 1474.2507 1476.0890 1484.2947 1486.2090 1660.9509 1690.6909 1693.9992 2842.9263 2875.8338 2903.0270 2926.5581 2957.7771 2965.9798 2966.7299 2969.1874 2981.9429 2993.8504 3030.8435 3035.2106 3036.0365 3042.5958 3045.2058 3068.1441 3075.9834 3085.5757 3090.8575 3115.7856
redmass: 4.7889 4.3364 3.1876 3.4356 3.8919 2.9604 3.9647 2.5203 1.2311 1.2413 2.0682 1.8035 1.6027 2.0622 3.1082 2.4868 2.4384 2.7318 2.6698 2.6112 2.6090 2.2458 2.4775 2.4615 2.2743 5.5607 1.2452 2.4339 2.9824 1.3365 2.1033 2.4954 1.9414 2.0741 4.1717 1.3939 1.5435 2.3087 1.8021 1.2848 1.5365 1.8037 1.7789 5.2706 1.6742 1.6829 2.3446 1.6539 1.1397 1.2084 1.1740 1.8841 1.8114 1.2995 1.2872 1.4045 1.3946 1.4575 1.2442 1.3294 1.3171 1.3406 1.2230 1.1181 1.0521 1.0821 1.0733 1.0572 1.0930 1.0540 1.0679 1.0796 1.0878 8.0365 6.5978 6.5354 1.0776 1.0606 1.0988 1.0606 1.0366 1.0393 1.0413 1.0569 1.0614 1.0999 1.0992 1.0965 1.0964 1.0967 1.0984 1.0934 1.0970 1.0973 1.0960 1.0901
irintensity: 2.8557 1.8199 0.1828 6.5592 7.2109 0.4794 7.6293 3.1643 0.0369 0.9120 1.5963 0.6791 1.4797 1.0593 1.0813 2.2099 0.8701 2.8213 0.1267 0.3334 5.3494 6.2405 3.7839 8.3801 5.5614 14.0782 0.9849 3.4455 0.5440 29.2327 6.4169 10.7989 11.4701 4.9025 140.1923 0.5878 2.9738 6.2387 1.7702 2.3017 5.8406 13.4505 5.2279 72.2562 6.7367 3.1624 5.1596 2.8479 5.8955 4.6185 4.4299 9.2723 4.7750 1.6194 20.4735 0.0770 1.5809 4.6140 10.7681 16.7222 22.1909 27.5213 5.4800 17.3260 0.5589 6.3233 0.4483 9.9324 14.4815 28.2112 13.8904 7.3730 12.4845 120.4418 10.9925 20.5806 86.0889 196.3028 44.0526 85.7776 36.7283 14.8259 41.2962 24.3666 93.6013 45.4668 14.2582 8.8710 32.7611 24.3287 27.3767 15.0618 64.4837 35.5639 28.0717 19.8707
temp: 298.150 k
press: 1.00000 atm
elementType: 8 8 6 6 6 6 6 6 6 6 6 6 6 6 1 1 1 1 1 1 1 1 1 1 1 1 1 1 1 1 1 1 1 1
symmnumber: 1
zpe: 761369.5 jmol-1
zpe.correction: 0.289990 hartree
zpe.thermalcorrener: 0.307550 hartree
zpe.thermalcorrenthalpy: 0.308494 hartree
zpe.thermalcorrgfe: 0.243089 hartree
zpe.sumelectzpe: -618.529701 hartree
zpe.sumelectthermal: -618.512141 hartree
zpe.sumelectthermalent: -618.511197 hartree
zpe.sumelectthermalfe: -618.576603 hartree
dipole: 0.9270 -4.3565 -0.0734
dipole: 4.4546
quadrupole: -75.7896 -86.7788 -84.1775
quadrupole: -9.6706 -1.4389 -1.8320
quadrupole: 6.4590 -4.5302 -1.9288 -9.6706 -1.4389 -1.8320
hfenergy: -618.8196914 hartree
pointgroup: C01 [X(C12H20O2)]
dipole: 1.0710908 -1.3601829 0.2723398 debye
polarizability: 156.8899915|18.6230852|145.2133488|1.4741588|-4.6536595|111.7934726 unknown
InChI: InChI=1S/C12H20O2/c1-11(2)5-4-6-12(3)7-9-14-10-8-13/h5,7-8H,4,6,9-10H2,1-3H3
charge 0 multiplicity 1
34 atoms
O  1.779833 0.025674 0.031212
O  2.539973 2.716354 0.150408
C  -2.376497 -1.963058 -0.397469
C  -3.125296 -0.632257 -0.017091
C  -0.973501 -2.022262 0.193484
C  -2.548944 0.582044 -0.716886
C  0.089057 -1.585556 -0.542698
C  -0.897297 -2.511925 1.62785
C  -1.720132 1.532757 -0.194493
C  1.513836 -1.438973 -0.09423
C  -1.164331 2.652646 -1.058592
C  -1.233074 1.563653 1.242438
C  3.180221 0.327878 0.204302
C  3.413634 1.829619 0.255166
H  -2.98023 -2.820824 -0.037106
H  -2.332386 -2.031087 -1.500913
H  -3.110404 -0.507689 1.081741
H  -4.188762 -0.756834 -0.30527
H  -2.804245 0.662767 -1.786014
H  -0.102915 -1.226511 -1.562535
H  -1.184906 -3.580078 1.690208
H  -1.614762 -1.95516 2.261829
H  0.102449 -2.402166 2.078934
H  2.213814 -1.857723 -0.852079
H  1.717227 -1.93231 0.878359
H  -0.056979 2.634105 -1.035718
H  -1.500269 2.57121 -2.107624
H  -1.472582 3.645334 -0.672965
H  -1.42097 2.557311 1.695398
H  -1.706143 0.799551 1.88188
H  -0.138188 1.399614 1.256981
H  3.806584 -0.076093 -0.63048
H  3.601585 -0.106304 1.145694
H  4.496597 2.089994 0.400978
