program: Gaussian 09
title: 000103838
version: EM64L-G09RevD.01
frameworkgroup: C1[X(C20H20ClN5O3S2)]
method: RPBEPBE
basis: SDD
operation: Freq
keyword: #p
keyword: freq=noraman
keyword: PBEPBE/SDD
title: #p freq=noraman PBEPBE/SDD
converged: YES YES NO NO
title: Mulliken charges:
elementType: Cl S S O O O N N N N N C C C C C C C C C C C C C C C C C C C C H H H H H H H H H H H H H H H H H H H H
charge: -0.048753 0.257556 0.303629 -0.311753 -0.280221 -0.153969 -0.150743 -0.068039 -0.244230 0.082879 0.056679 -0.377154 -0.373431 -0.360731 -0.359084 -0.159399 -0.126093 0.355302 -0.291731 0.248620 -0.613350 0.149934 -0.635244 -0.608549 -0.270273 -0.281326 -0.291119 0.437562 -0.202885 -0.193537 -0.352737 0.230633 0.253419 0.243487 0.222880 0.192744 0.220213 0.218537 0.192403 0.271119 0.225828 0.226929 0.191375 0.259885 0.319231 0.263286 0.284250 0.277789 0.259419 0.258659 0.250105
chargesum: 0.00000
title: Mulliken charges with hydrogens summed into heavy atoms:
elementType: Cl S S O O O N N N N N C C C C C C C C C C C C C C C C C C C C
charge: -0.048753 0.257556 0.303629 -0.311753 -0.280221 -0.153969 -0.150743 -0.068039 -0.244230 0.082879 0.056679 0.106898 0.092936 0.052226 0.051856 0.111720 -0.126093 0.355302 -0.291731 0.248620 0.030781 0.149934 -0.056128 -0.061012 0.007516 -0.021907 -0.291119 0.437562 -0.202885 0.065122 -0.102633
polarizability: 4.56504451e+02 3.07379690e+01 3.43368409e+02 2.42488742e+01 -3.88675418e+01 1.93389546e+02
1716.lowfreq: -4.4049 -4.2397 -0.0009 -0.0007 0.0012 1.0068 11.7743 14.3541 19.7500
frequency: 11.2654 11.7462 19.6686 22.9583 42.7555 45.5893 53.7564 59.0466 91.1067 94.6388 105.9256 120.6130 133.9132 152.6254 163.2923 171.6795 207.4425 211.0259 220.8526 226.2633 230.8031 242.3674 264.8263 283.3787 305.6288 311.4060 318.2146 325.0953 346.4704 360.4196 370.4430 373.7265 399.1560 412.6067 423.1304 449.2733 474.3600 488.6168 492.4498 519.3303 524.5758 538.8245 546.0605 584.3561 588.5291 592.9219 616.8925 617.6178 638.0517 665.2202 682.3326 694.9628 707.3997 718.2711 733.5332 746.6876 782.2852 790.2796 801.8780 830.6280 841.0998 847.7017 859.8453 870.5719 888.5266 912.5843 913.8563 927.1434 938.6833 947.5155 957.7489 986.5952 1004.6612 1020.2028 1028.4700 1042.4768 1051.8690 1054.0033 1067.8573 1079.6678 1099.5601 1117.4636 1125.5368 1136.2417 1144.2136 1148.7447 1165.3444 1178.2885 1185.1743 1191.3201 1197.9593 1210.4924 1213.5034 1245.6281 1259.3843 1283.0577 1287.6172 1288.6030 1299.2509 1305.2776 1317.2124 1327.9216 1333.9694 1340.3693 1351.7458 1359.2246 1361.7534 1370.6766 1391.3112 1406.6960 1420.6227 1429.9679 1432.2388 1434.7534 1455.6849 1458.4979 1461.1696 1464.6698 1474.1345 1474.5412 1481.5889 1501.5862 1588.8233 1595.3017 1598.8249 1657.1152 1669.5667 2845.5151 2851.9963 2871.7728 2985.4558 2992.7572 3023.1547 3027.3901 3033.1584 3033.8726 3037.3869 3038.7487 3080.6823 3101.4917 3105.9131 3120.2846 3121.7445 3131.7851 3153.8178 3181.3126 3185.0944
redmass: 4.6028 5.8634 5.4967 6.1133 5.0187 6.6880 5.2605 7.2871 7.6993 6.6838 8.8821 5.0772 7.3377 11.1407 3.3691 6.8607 5.2579 2.3554 7.0318 2.0542 8.9397 2.0155 2.7658 8.6945 2.3966 8.3545 3.0129 6.1904 3.1490 13.0247 9.5920 5.7512 2.4233 3.7127 4.0699 6.0196 2.7541 5.8131 6.2518 6.4776 4.1043 7.5348 5.4736 3.5010 5.3023 5.8064 4.1044 5.0661 8.6771 6.1443 8.4743 4.9670 5.3522 7.8795 10.9371 3.2960 7.4338 8.2197 4.3158 1.4281 1.6141 1.9312 3.1996 2.8833 3.2437 3.3970 7.0982 1.6981 2.8819 1.4378 4.0870 1.3144 2.4664 5.2350 3.0510 2.4869 1.7442 2.1660 1.6752 1.7591 3.5282 2.9471 1.7065 1.1271 2.2995 2.5256 2.5832 2.4020 1.2959 2.8395 1.1027 1.9471 1.7789 4.0853 1.9505 1.2538 1.5377 1.5152 1.1995 5.8098 2.4975 1.7753 1.2631 1.4327 1.3533 4.6626 1.3419 1.4826 3.0460 2.5419 2.9427 1.0842 1.1694 1.0865 1.0790 1.0800 1.0813 1.0891 1.2722 2.8966 1.0531 5.5795 8.0047 10.4024 7.6642 10.1881 12.5620 1.0713 1.0666 1.0587 1.0688 1.0667 1.0738 1.0578 1.0852 1.0884 1.0590 1.0901 1.1010 1.0966 1.1066 1.1075 1.0939 1.0907 1.0894 1.0972 1.0956
irintensity: 5.2277 0.1358 1.1136 0.7459 0.1421 1.1231 1.0078 1.7195 1.2538 0.9498 0.7692 0.2326 3.5551 0.4877 4.3674 1.1126 0.6777 4.8290 7.1802 0.6753 4.3443 4.9712 1.9630 0.7851 12.5108 8.7777 8.6532 0.7979 5.9759 8.8261 1.9878 6.3662 2.0344 3.7055 1.6320 4.9265 0.1513 7.3077 4.2593 7.3425 1.8691 1.8371 11.2549 5.4780 4.2398 1.4155 3.9479 4.9357 22.3058 1.1190 13.5753 16.9652 21.0376 15.4012 26.1534 6.8054 30.7839 19.4584 0.4605 33.9429 16.4850 50.7167 193.1348 116.5533 8.7648 58.7819 56.3848 37.4741 70.4965 0.1329 281.6063 1.3873 59.4694 31.0981 10.2529 88.4758 6.7959 2.8976 10.4795 14.7720 74.8269 14.0647 35.7597 1.8250 78.2635 42.5945 10.2430 65.2652 4.1109 254.3525 5.9370 41.5426 186.4034 26.4833 4.0943 6.8385 42.3769 17.4409 38.8205 44.9054 23.0481 173.6385 6.3708 83.6552 2.8358 346.5944 17.1310 0.6651 367.8059 148.4859 60.2948 7.7380 4.2877 10.3980 0.4465 13.4314 28.2196 14.4197 57.4401 139.6817 8.6783 116.3886 42.1830 260.5184 219.4513 471.9203 203.2153 45.3501 57.1055 188.4194 27.5181 40.5665 46.9761 10.6095 8.0384 48.0625 29.0388 46.4908 30.0576 5.0220 3.0774 4.3100 6.0573 24.8839 1.9216 1.5505 1.9130
temp: 298.150 k
press: 1.00000 atm
elementType: 17 16 16 8 8 8 7 7 7 7 7 6 6 6 6 6 6 6 6 6 6 6 6 6 6 6 6 6 6 6 6 1 1 1 1 1 1 1 1 1 1 1 1 1 1 1 1 1 1 1 1
symmnumber: 1
zpe: 995091.0 jmol-1
zpe.correction: 0.379010 hartree
zpe.thermalcorrener: 0.407421 hartree
zpe.thermalcorrenthalpy: 0.408366 hartree
zpe.thermalcorrgfe: 0.315488 hartree
zpe.sumelectzpe: -2527.475686 hartree
zpe.sumelectthermal: -2527.447274 hartree
zpe.sumelectthermalent: -2527.446330 hartree
zpe.sumelectthermalfe: -2527.539208 hartree
dipole: -6.2486 5.4166 -3.7404
dipole: 9.0761
quadrupole: -161.8550 -200.0990 -206.7621
quadrupole: 12.4326 -1.9734 8.0312
quadrupole: 27.7170 -10.5270 -17.1900 12.4326 -1.9734 8.0312
hfenergy: -2527.8546958 hartree
pointgroup: C01 [X(C20H20Cl1N5O3S2)]
dipole: -2.5354361 -2.0054646 1.5166964 debye
polarizability: 457.1408351|-31.6937604|338.3390746|-13.3406988|-49.2483581|197.7824954 unknown
InChI: InChI=1S/C20H20ClN5O3S2/c1-24-6-8-25(9-7-24)20(28)29-19-16-15(30-10-11-31-16)18(27)26(19)14-3-2-12-13(21)4-5-22-17(12)23-14/h2-5,19H,6-11H2,1H3
charge 0 multiplicity 1
51 atoms
Cl 5.842413 -2.962762 1.002795
S  -3.120826 2.157484 1.577881
S  -1.69373 4.474289 -0.867823
O  -1.21362 -0.404946 0.710571
O  -2.241297 0.305629 -1.308541
O  0.975643 2.93723 -1.605384
N  -2.484427 -1.885575 -0.511036
N  -4.37341 -4.017633 -0.206533
N  0.543571 1.241853 0.060082
N  2.896258 1.287009 -0.152602
N  5.220641 1.44846 -0.42078
C  -3.307705 -2.31502 -1.662713
C  -2.254142 -2.933111 0.505794
C  -4.634774 -2.918122 -1.166364
C  -3.601834 -3.52959 0.960727
C  -0.579703 0.927129 0.950611
C  -1.515279 2.111324 0.771089
C  -2.014595 -0.594413 -0.460148
C  -1.014638 2.97433 -0.158508
C  0.280795 2.451729 -0.692834
C  -5.603923 -4.731204 0.18672
C  1.795458 0.584524 0.165579
C  -4.014065 3.107042 0.192354
C  -3.418047 4.494801 -0.056575
C  1.833644 -0.781433 0.630184
C  3.066291 -1.410549 0.743233
C  4.125562 0.673325 -0.069869
C  4.260639 -0.706341 0.388309
C  5.581957 -1.23961 0.445528
C  6.683057 -0.469791 0.086157
C  6.43581 0.876881 -0.337741
H  -2.750591 -3.082458 -2.234856
H  -3.482643 -1.440341 -2.308586
H  -1.716282 -2.499358 1.36026
H  -1.638873 -3.739048 0.058173
H  -5.25789 -2.106622 -0.708962
H  -5.190483 -3.326044 -2.030744
H  -3.406563 -4.381001 1.638899
H  -4.167361 -2.752602 1.537796
H  -0.230668 0.789702 1.990165
H  -5.347149 -5.582309 0.842347
H  -6.10253 -5.13355 -0.713058
H  -6.338365 -4.084545 0.729768
H  -5.054412 3.193918 0.548611
H  -3.970724 2.467245 -0.703697
H  -4.034487 5.044727 -0.789675
H  -3.353798 5.077445 0.874966
H  0.902592 -1.305196 0.858219
H  3.136111 -2.447791 1.085135
H  7.701768 -0.86208 0.122936
H  7.284622 1.509968 -0.622061
