program: Gaussian 09
title: 000103340
version: EM64L-G09RevD.01
frameworkgroup: C1[X(C6H13FO2S)]
method: RPBEPBE
basis: SDD
operation: Freq
keyword: #p
keyword: freq=noraman
keyword: PBEPBE/SDD
title: #p freq=noraman PBEPBE/SDD
converged: YES YES NO NO
title: Mulliken charges:
elementType: S F O O C C C C C C H H H H H H H H H H H H H
charge: 1.123017 -0.350638 -0.489533 -0.488563 -0.363345 -0.325160 -0.350146 -0.629371 -0.354804 -0.690302 0.205832 0.204580 0.237287 0.238196 0.197846 0.198088 0.296535 0.297176 0.198302 0.198722 0.212494 0.221252 0.212535
chargesum: 0.00000
title: Mulliken charges with hydrogens summed into heavy atoms:
elementType: S F O O C C C C C C
charge: 1.123017 -0.350638 -0.489533 -0.488563 0.047068 0.150323 0.045788 -0.035660 0.042220 -0.044022
polarizability: 1.31611330e+02 1.67334916e+00 8.63659275e+01 -2.56215570e-01 1.63952033e-01 8.73396463e+01
1716.lowfreq: -4.4822 0.0011 0.0016 0.0022 3.8383 6.2154 29.7854 53.4161 60.1014
frequency: 27.7554 51.8568 60.0897 74.2629 117.8595 133.8812 139.9521 172.0023 203.5918 228.8661 244.2432 266.8151 300.9309 360.4542 405.4414 436.8109 553.7705 592.1925 729.7479 749.3759 786.3581 866.8316 872.3216 891.3113 957.8191 996.6087 997.8715 1031.2363 1053.4303 1073.9039 1101.4247 1114.3621 1191.1697 1228.3332 1238.6381 1268.0906 1280.3016 1291.5076 1301.8344 1315.9429 1342.0310 1352.6219 1393.8788 1412.2012 1466.5414 1467.6202 1475.2234 1478.2547 1483.0461 1489.8447 2963.5388 2968.9969 2976.5881 2976.9981 2999.8512 3002.6003 3019.5024 3041.5462 3053.8704 3066.8452 3074.1685 3077.1814 3145.1447
redmass: 5.3331 1.8067 5.2953 2.7216 1.8015 5.2348 2.1808 7.2452 4.9694 1.1382 3.7439 6.4396 11.8620 6.2506 3.2947 4.5102 16.4193 5.7695 1.0674 1.0935 1.1875 17.0715 1.2726 1.9051 2.0060 2.5384 2.4239 3.5070 3.0125 2.4504 1.3691 2.4372 1.6556 1.2199 1.3326 1.2481 1.1518 1.0668 1.0970 1.3122 1.3817 1.5667 1.2125 1.1060 1.0673 1.0753 1.0678 1.0418 1.0817 1.0940 1.0587 1.0592 1.0579 1.0374 1.0587 1.0987 1.1023 1.1047 1.0564 1.1051 1.1010 1.0993 1.1108
irintensity: 3.3921 0.3870 3.7258 0.2111 0.2102 1.2236 0.0068 8.9869 1.2661 0.0410 2.2314 5.9726 1.3172 49.5173 7.5204 16.5109 120.9672 1.3378 12.3369 1.1170 1.7825 59.3465 3.9709 3.5337 28.5461 22.1900 24.9623 5.1795 9.9727 0.9927 17.8809 28.1365 1.6648 3.8628 0.6437 13.0947 0.1156 1.0779 0.1131 14.9177 5.1824 0.2000 10.7776 6.8661 1.6476 0.3394 3.3418 13.4171 1.6970 27.1895 0.0297 3.1899 65.5006 54.7871 18.2463 0.4257 0.3032 35.7316 4.0287 17.1312 97.9527 46.8741 0.5417
temp: 298.150 k
press: 1.00000 atm
elementType: 16 9 8 8 6 6 6 6 6 6 1 1 1 1 1 1 1 1 1 1 1 1 1
symmnumber: 1
zpe: 487103.2 jmol-1
zpe.correction: 0.185528 hartree
zpe.thermalcorrener: 0.198924 hartree
zpe.thermalcorrenthalpy: 0.199868 hartree
zpe.thermalcorrgfe: 0.143750 hartree
zpe.sumelectzpe: -883.790525 hartree
zpe.sumelectthermal: -883.777129 hartree
zpe.sumelectthermalent: -883.776185 hartree
zpe.sumelectthermalfe: -883.832303 hartree
dipole: 6.4602 1.7036 0.0242
dipole: 6.6811
quadrupole: -86.7162 -71.8971 -73.1335
quadrupole: -1.7065 0.0220 -0.0521
quadrupole: -9.4673 5.3519 4.1154 -1.7065 0.0220 -0.0521
hfenergy: -883.9760525 hartree
pointgroup: C01 [X(C6H13F1O2S1)]
dipole: -2.5436714 -0.6582405 -0.0753619 debye
dipolederiv: 1.3784146 -0.10202 -0.0164245 -0.0362053 1.4610979 0.0268585 -0.0056636 0.0275896 1.3172382 -0.7530165 0.2212021 0.0413377 0.3979995 -0.728815 -0.0708326 0.074821 -0.0697605 -0.3480271 -0.5507505 -0.0485613 -0.0100488 -0.1765144 -0.5002906 0.0689736 0.0201472 0.0954933 -0.5572462 -0.5503703 -0.0516098 -0.0099842 -0.1653784 -0.456119 -0.0312398 -0.082292 -0.0595378 -0.6003806 -0.0178486 0.0311768 0.0032608 0.3936365 0.1230176 -0.0100983 0.0467252 -0.0086293 0.1950641 -0.3157313 -0.0215122 -0.0021831 -0.3238317 -0.025938 -0.0164108 -0.0437266 -0.0166227 0.1070398 -0.0336581 -0.020545 -0.0028083 -0.2376897 0.064454 -0.0122055 -0.0268907 -0.0127812 0.1746954 0.5659622 0.075315 0.0071074 0.0423511 0.0310516 0.007586 0.004487 0.0078143 -0.0195747 0.0217336 0.0215346 0.0021362 0.1838477 0.1005735 -0.0085553 0.0201597 -0.00823 0.1743367 -0.0904887 0.0430784 0.004256 -0.0457229 0.0454486 -0.0050707 -0.0061153 -0.0050858 0.0927839 0.0517515 0.0009463 -0.0072806 -0.0088014 -0.0562355 0.1026993 -0.0030356 0.1287016 -0.0432943 0.0538728 0.0004551 0.0079892 -0.0072133 -0.0025179 -0.0930928 0.0031715 -0.1188206 -0.0975163 0.0812341 -0.0037263 -0.0154406 0.02306 0.0354524 -0.0672478 -0.0058484 -0.082371 -0.0477691 0.0817704 -0.0061901 0.0130699 0.0218742 -0.0069555 0.077395 0.0101058 0.0917051 -0.0035773 0.0327842 -0.012917 0.0151589 0.0026997 -0.0614398 0.1101112 0.0107794 0.1335862 -0.0510145 0.0321753 -0.0084424 -0.0170413 0.0058152 -0.006484 -0.099789 -0.0091095 -0.1231923 -0.1062559 -0.0151422 -0.0327147 0.0008573 -0.0098279 0.0282137 0.0447087 -0.0554211 0.0486918 0.0371621 -0.0155918 -0.0307649 -0.0095634 -0.0245444 0.0547552 -0.0390899 0.0500074 -0.043732 0.0125231 0.0317389 0.0189799 0.024607 -0.0076528 -0.0143751 -0.1126097 -0.0055355 -0.1402861 -0.1153208 0.0316987 0.022124 -0.0187522 -0.0103987 -0.0741998 0.1219761 0.0048575 0.1497912 -0.0551892 0.0854821 -0.0097951 0.0317006 0.0449415 -0.0437948 0.1221719 -0.0109691 0.1407813 -0.0553048 -0.1915783 -0.0850437 -0.01101 -0.1051187 0.0203474 -0.0100569 -0.0135958 -0.0098387 0.1017099 0.0855577 -0.0009698 -0.0309441 0.0426742 0.0127529 -0.1061812 0.0229415 -0.1252662 -0.1120824 unknown
polarizability: 131.6211134|1.4895178|86.4139699|0.4517249|-0.2840171|87.2818201 unknown
InChI: InChI=1S/C6H13FO2S/c1-2-3-4-5-6-10(7,8)9/h2-6H2,1H3
charge 0 multiplicity 1
23 atoms
S  2.775171 0.224439 0.036218
F  3.842338 -1.287909 -0.235943
O  2.989256 1.196761 -1.225179
O  3.044187 0.738246 1.534804
C  -1.408611 -0.614163 -0.062565
C  -0.08345 0.189666 0.037977
C  -2.646124 0.308014 0.042309
C  1.108854 -0.754037 -0.095185
C  -3.979724 -0.468271 -0.051731
C  -5.212782 0.455776 0.045813
H  -1.446622 -1.374816 0.743136
H  -1.440962 -1.164181 -1.024882
H  -0.047744 0.717942 1.009691
H  -0.055752 0.953911 -0.761702
H  -2.607452 1.069083 -0.763776
H  -2.612148 0.863995 1.001648
H  1.210504 -1.489293 0.718981
H  1.205403 -1.238626 -1.079809
H  -4.010496 -1.027961 -1.00862
H  -4.019828 -1.22705 0.755934
H  -5.213385 1.204476 -0.768375
H  -6.15326 -0.120199 -0.024702
H  -5.223872 1.004096 1.006458
