program: Gaussian 09
title: 000103406
version: EM64L-G09RevD.01
frameworkgroup: C1[X(C11H4F19I)]
method: RPBEPBE
basis: SDD
operation: Freq
keyword: #p
keyword: freq=noraman
keyword: PBEPBE/SDD
title: #p freq=noraman PBEPBE/SDD
converged: YES YES NO NO
title: Mulliken charges:
elementType: I F F F F F F F F F F F F F F F F F F F C C C C C C C C C C C H H H H
charge: 0.084046 -0.120205 -0.128308 -0.110747 -0.121458 -0.118514 -0.134603 -0.113124 -0.117728 -0.134263 -0.124791 -0.114417 -0.124289 -0.159657 -0.162384 -0.126271 -0.123516 -0.120100 -0.119422 -0.123580 0.238855 0.247594 0.246316 0.254289 0.224559 0.210450 0.297771 0.196150 -0.408172 0.402338 -0.785813 0.283662 0.276299 0.316609 0.312426
chargesum: 0.00000
title: Mulliken charges with hydrogens summed into heavy atoms:
elementType: I F F F F F F F F F F F F F F F F F F F C C C C C C C C C C C
charge: 0.084046 -0.120205 -0.128308 -0.110747 -0.121458 -0.118514 -0.134603 -0.113124 -0.117728 -0.134263 -0.124791 -0.114417 -0.124289 -0.159657 -0.162384 -0.126271 -0.123516 -0.120100 -0.119422 -0.123580 0.238855 0.247594 0.246316 0.254289 0.224559 0.210450 0.297771 0.196150 0.151789 0.402338 -0.156779
polarizability: 1.82520280e+02 1.97684938e+01 1.39731830e+02 -7.15023116e+00 -6.47358435e+00 1.22172659e+02
1716.lowfreq: -12.1097 -4.5127 -3.4907 -0.0008 -0.0007 -0.0002 10.4967 18.3366 25.8794
frequency: 10.4431 18.2333 25.8723 37.3945 37.5815 57.0397 59.4123 62.7170 77.0683 80.4127 88.5350 109.6323 120.0733 123.1075 131.2509 143.7844 152.2021 166.3567 174.6193 196.6067 206.2518 217.9840 225.9613 238.3696 245.7330 248.7622 259.4505 261.0121 275.4060 279.6442 285.6150 292.4448 298.8220 302.8255 305.1376 313.5086 318.0669 326.4698 336.7366 351.8801 377.3008 399.7124 415.3175 426.8842 445.7086 457.1471 462.7267 509.4218 517.1500 534.8914 540.5776 556.3944 559.2036 578.4917 584.9867 588.5090 611.2419 652.2675 730.1204 755.6408 778.6955 820.0783 866.1443 880.6826 917.1821 961.9487 978.7242 996.9280 998.2421 1011.7207 1012.9216 1022.8242 1030.3475 1034.1360 1040.3546 1049.6242 1054.8913 1063.6831 1069.5102 1085.9367 1108.1673 1118.1903 1126.8143 1134.7592 1142.6595 1152.4697 1157.0667 1168.3793 1180.6764 1202.8925 1230.2982 1303.0620 1352.0163 1444.9686 1454.4772 3038.1115 3078.3213 3101.4982 3166.0357
redmass: 24.4222 19.0536 14.9508 14.8985 17.1997 16.4648 4.3623 14.1827 4.6754 9.2588 6.5012 15.4702 17.6792 17.7792 17.3966 13.3571 19.7307 15.9342 17.4875 15.8864 16.3445 17.8517 12.2726 13.2454 17.4172 17.1450 16.8244 18.0523 16.5065 17.4882 14.9113 17.6778 17.2938 17.7224 14.0046 13.6395 15.0732 7.5797 18.6850 11.5359 10.4316 10.7963 11.9172 12.3214 15.6055 17.1035 17.6401 10.1851 16.2676 10.0883 16.9693 13.8789 15.2380 12.6623 15.7267 16.1349 17.4979 17.1583 5.3776 1.2115 13.5664 12.8098 12.3172 2.3201 10.5577 12.1217 12.4366 5.8188 3.8773 4.2409 8.8639 12.1457 11.0040 10.4314 11.8437 10.3307 11.4515 7.7061 7.7907 13.0567 12.7561 11.7467 11.7785 10.7444 10.9264 10.6416 12.2070 4.5596 1.5196 12.2371 1.2682 1.1489 1.4134 1.0760 1.1013 1.0607 1.0562 1.1030 1.1108
irintensity: 0.0085 0.0054 0.0137 0.0182 0.0968 0.1940 1.6991 0.2689 1.9499 0.2930 0.2184 0.7714 1.1215 0.3753 0.4812 1.0509 0.7816 0.1923 3.7201 33.3640 4.9850 0.8443 1.1571 0.6712 1.0438 0.2447 1.3527 1.8608 0.4970 2.7710 0.3422 0.5954 0.6022 0.1217 1.0205 0.4777 0.9704 0.4715 0.1442 0.6557 6.0901 5.2287 5.2281 1.7510 1.4661 5.2251 5.7116 21.5019 8.6660 19.2769 6.9971 16.5834 7.5981 15.7497 2.3822 5.6091 5.0611 58.1888 27.4544 2.3381 339.0732 67.5370 60.3905 61.0945 68.5874 22.2504 2.9414 15.4983 191.4900 72.8992 35.2827 26.5493 45.5928 20.7581 117.4536 53.5615 24.5131 176.2107 120.7000 469.0056 29.8410 34.4319 146.5025 50.4572 6.9771 20.6344 3.7151 15.9142 28.9756 37.6786 17.0218 3.7152 51.2986 6.1640 12.7833 6.7028 3.6664 0.2239 0.4186
temp: 298.150 k
press: 1.00000 atm
elementType: 53 9 9 9 9 9 9 9 9 9 9 9 9 9 9 9 9 9 9 9 6 6 6 6 6 6 6 6 6 6 6 1 1 1 1
symmnumber: 1
zpe: 409730.3 jmol-1
zpe.correction: 0.156058 hartree
zpe.thermalcorrener: 0.188174 hartree
zpe.thermalcorrenthalpy: 0.189118 hartree
zpe.thermalcorrgfe: 0.089070 hartree
zpe.sumelectzpe: -2327.598185 hartree
zpe.sumelectthermal: -2327.566069 hartree
zpe.sumelectthermalent: -2327.565125 hartree
zpe.sumelectthermalfe: -2327.665173 hartree
dipole: -1.1079 -0.7851 0.0539
dipole: 1.3590
quadrupole: -189.4810 -196.6778 -193.1074
quadrupole: -0.7269 -0.1254 -0.4498
quadrupole: 3.6078 -3.5891 -0.0187 -0.7269 -0.1254 -0.4498
hfenergy: -2327.7542432 hartree
pointgroup: C01 [X(C11H4F19I1)]
dipole: 0.3778963 -0.3754954 0.0454613 debye
polarizability: 174.7699056|-26.3811783|149.3254771|-1.3706375|2.7366737|120.3293866 unknown
InChI: InChI=1S/C11H4F19I/c12-3(13,1-2-31)4(14,15)5(16,17)6(18,19)7(20,21)8(22,23)9(24,25)10(26,27)11(28,29)30/h1-2H2
charge 0 multiplicity 1
35 atoms
I  7.0281 -2.692908 0.441948
F  -0.262867 -1.709998 -0.425967
F  1.446934 -1.410922 1.051282
F  0.575207 1.125457 1.672658
F  -0.923751 -0.569894 1.964798
F  0.68075 0.25694 -2.07239
F  2.136018 -1.424317 -1.565304
F  -1.920656 1.950213 1.383943
F  -0.796006 2.003595 -0.595633
F  3.259539 0.980345 -2.131917
F  2.083058 2.041103 -0.48366
F  -2.196344 -0.143452 -1.571558
F  -3.455162 1.603542 -0.814845
F  3.340236 0.519238 1.475683
F  4.720908 1.645307 0.051812
F  -2.988919 -1.757915 0.418281
F  -3.762758 -0.037177 1.711106
F  -5.835344 0.457872 0.010833
F  -5.654677 -1.77362 0.339563
F  -4.962244 -0.8641 -1.621455
C  0.603818 -0.738983 0.129444
C  -0.289051 0.243995 0.991339
C  1.523751 -0.242617 -1.056777
C  -1.415935 1.143152 0.339773
C  2.679126 0.812328 -0.842894
C  -2.658582 0.503524 -0.405811
C  3.864526 0.499916 0.143985
C  -3.597077 -0.485652 0.383873
C  4.668393 -0.773739 -0.110168
C  -5.037672 -0.660322 -0.238057
C  5.882181 -0.848293 0.832372
H  4.996256 -0.77627 -1.164192
H  4.015577 -1.649659 0.039255
H  6.592244 -0.026188 0.671308
H  5.590021 -0.904899 1.890272
