program: Gaussian 09
title: 000103369
version: EM64L-G09RevD.01
frameworkgroup: C1[X(C6H18O14P4)]
method: RPBEPBE
basis: SDD
operation: Freq
keyword: #p
keyword: freq=noraman
keyword: PBEPBE/SDD
title: #p freq=noraman PBEPBE/SDD
converged: YES YES NO NO
title: Mulliken charges:
elementType: P P P P O O O O O O O O O O O O O O C C C C C C H H H H H H H H H H H H H H H H H H
charge: 1.234818 1.344535 1.320174 1.270180 -0.414632 -0.387639 -0.662307 -0.668534 -0.645581 -0.749648 -0.671326 -0.742114 -0.772829 -0.663434 -0.561097 -0.568070 -0.564196 -0.598448 -0.686600 -0.575778 -0.336285 -0.395437 -0.374107 -0.360100 0.250673 0.280416 0.245640 0.295346 0.217976 0.253447 0.241758 0.243487 0.402631 0.435403 0.406561 0.428938 0.413200 0.418571 0.450602 0.420337 0.421754 0.401712
chargesum: 0.00000
title: Mulliken charges with hydrogens summed into heavy atoms:
elementType: P P P P O O O O O O O O O O O O O O C C C C C C
charge: 1.234818 1.344535 1.320174 1.270180 -0.012000 0.047764 -0.255746 -0.239596 -0.232380 -0.331076 -0.220724 -0.321776 -0.351075 -0.261723 -0.561097 -0.568070 -0.564196 -0.598448 -0.686600 -0.575778 0.194804 0.145549 0.097316 0.125146
polarizability: 2.30480552e+02 5.72832033e+00 2.11660826e+02 -5.12098647e+00 -6.89808516e+00 1.84471900e+02
1716.lowfreq: -21.5454 -3.5321 0.0006 0.0015 0.0022 4.3990 10.4397 19.3431 23.2874
frequency: -20.5257 17.1283 23.0101 34.2156 44.6855 49.5042 55.8690 66.9008 75.4527 89.4624 115.8837 116.2883 131.1190 140.9336 147.6293 165.9295 169.7747 172.9542 182.3367 185.2982 197.7700 200.8159 214.5854 225.9887 241.3322 242.9636 248.5950 254.4146 266.2966 282.7539 290.3011 291.7607 297.8134 307.6872 322.9391 330.8032 337.2374 347.4480 351.1242 353.2214 367.8969 372.1331 396.2254 399.4607 405.8192 423.8088 450.3803 491.2691 522.6360 541.6529 570.7518 605.7313 616.5243 619.5940 641.5480 660.4799 670.6794 697.5633 698.6992 714.6598 728.7070 738.4611 752.0736 766.2902 776.6352 779.0046 818.6753 903.9693 937.0301 954.3704 958.1127 979.4493 986.8144 997.9505 1004.3039 1014.9315 1033.6781 1051.1251 1060.7746 1063.6980 1070.7773 1076.7550 1098.7434 1102.4580 1118.0697 1137.8368 1150.9542 1184.9159 1256.2072 1263.1707 1285.1149 1312.3637 1314.6138 1317.1987 1340.9902 1367.1356 1383.9257 1387.4885 1450.7109 1455.1092 1477.2983 1492.3749 2979.6866 2986.1049 2989.8073 2997.7732 3032.0471 3033.0620 3042.6987 3057.4658 3074.2671 3302.5549 3339.0569 3357.6822 3411.8129 3589.0169 3602.9852 3604.8162 3611.1700 3649.6699
redmass: 3.1716 8.4263 8.3320 8.1759 7.2406 9.8185 6.5927 5.6748 2.3340 6.6963 5.7711 1.9119 5.0570 4.5934 3.2567 4.9048 7.0442 2.6271 3.2366 2.8676 5.3990 5.4030 2.4030 5.0489 5.4561 4.0420 3.5228 3.4057 4.2002 4.9762 6.1612 5.9846 3.5900 4.9201 6.5680 5.1832 6.4081 3.5607 3.2234 3.7445 4.0123 1.1619 5.9371 6.6955 5.2969 5.7219 6.0117 1.6205 2.2340 4.2855 3.9705 1.2761 1.3215 8.8200 8.5657 8.7699 5.7334 4.6780 2.3239 3.7701 3.9583 7.1504 1.9896 1.2673 2.3933 1.5993 1.4898 3.1629 4.1371 1.7066 1.5479 1.4392 1.3035 1.5928 1.9606 2.7872 1.4670 6.7603 3.9425 4.4766 3.4497 3.9043 2.7177 3.3800 1.9537 1.8937 1.2476 1.3445 1.2748 1.2485 1.1005 1.2024 1.1444 1.1345 1.3018 1.2824 1.3987 1.3546 1.0825 1.0780 1.0744 1.0948 1.0612 1.0606 1.0602 1.0621 1.0691 1.0968 1.1003 1.1027 1.1036 1.0642 1.0651 1.0651 1.0638 1.0663 1.0664 1.0661 1.0665 1.0670
irintensity: 27.2926 2.7271 0.9284 0.9542 1.7495 2.3196 11.6062 6.1928 52.7290 1.4895 4.8119 1.2801 15.4456 11.6034 0.6920 3.3115 27.4313 50.9781 8.0455 14.2221 16.0606 8.6390 47.3883 37.8471 1.6927 12.8400 22.1446 4.4776 13.7166 18.4664 6.4164 39.5473 37.6253 131.8029 1.9945 24.8478 8.2951 20.0233 73.8712 6.9657 33.1408 195.0172 85.2566 69.5928 2.9340 28.7979 10.3681 11.5632 55.7181 10.2102 34.7061 93.9414 112.8782 45.4539 86.0199 183.3870 182.1950 35.4833 40.6465 150.2338 122.0635 157.0102 193.6150 44.1422 84.4042 391.8103 5.6180 54.2214 83.1988 37.8738 76.2694 21.6049 36.5382 18.5207 98.0335 9.9468 62.7539 98.5013 90.4904 80.2698 102.8078 13.3936 23.4243 36.9891 71.1394 45.2229 218.9800 9.3053 31.2942 4.5682 231.6223 9.0549 2.7373 0.1272 108.8483 13.8837 64.9476 63.5173 11.6365 0.1299 0.5347 17.5379 1.8675 2.2786 2.7045 21.3504 466.2381 14.4776 0.7699 0.7438 22.0205 161.1097 163.7449 113.4731 59.5291 79.7378 85.9557 82.8302 73.5470 107.5490
temp: 298.150 k
press: 1.00000 atm
elementType: 15 15 15 15 8 8 8 8 8 8 8 8 8 8 8 8 8 8 6 6 6 6 6 6 1 1 1 1 1 1 1 1 1 1 1 1 1 1 1 1 1 1
symmnumber: 1
zpe: 738512.7 jmol-1
zpe.correction: 0.281285 hartree
zpe.thermalcorrener: 0.312589 hartree
zpe.thermalcorrenthalpy: 0.313533 hartree
zpe.thermalcorrgfe: 0.218477 hartree
zpe.sumelectzpe: -2655.499593 hartree
zpe.sumelectthermal: -2655.468289 hartree
zpe.sumelectthermalent: -2655.467345 hartree
zpe.sumelectthermalfe: -2655.562401 hartree
dipole: -0.7764 6.0520 -2.1731
dipole: 6.4771
quadrupole: -135.0406 -178.7066 -181.8155
quadrupole: -12.7221 13.6232 9.9099
quadrupole: 30.1470 -13.5190 -16.6280 -12.7221 13.6232 9.9099
hfenergy: -2655.7808776 hartree
pointgroup: C01 [X(C6H18O14P4)]
dipole: -0.2807612 2.3970696 -0.817878 debye
polarizability: 230.2108706|5.0063454|211.5217285|-7.258743|-6.7029017|184.8806789 unknown
InChI: InChI=1S/C6H18O14P4/c7-5(21(9,10)11,22(12,13)14)3-1-2-4-6(8,23(15,16)17)24(18,19)20/h7-10,12-13,15-16,18-19H,1-4H2
charge 0 multiplicity 1
42 atoms
P  3.767816 1.180925 0.937776
P  3.849702 -1.676992 -0.401099
P  -4.320879 -1.210189 1.095552
P  -3.572436 1.657995 -0.270815
O  4.217778 0.672592 -1.718062
O  -3.208106 -0.816725 -1.402764
O  3.295345 2.749477 0.419396
O  5.49642 1.282842 0.677803
O  4.416671 -2.034128 -1.986203
O  5.311323 -1.399306 0.559607
O  -5.397625 -0.187264 1.936022
O  -5.305926 -1.772907 -0.229811
O  -4.164093 1.986645 1.370373
O  -5.024952 1.529042 -1.193432
O  3.265276 0.704541 2.366486
O  2.910319 -2.801213 0.202949
O  -3.630153 -2.340681 1.966613
O  -2.58026 2.813024 -0.742735
C  3.342703 0.192185 -0.653147
C  -3.099435 -0.231213 -0.110008
C  1.884383 0.316602 -1.098286
C  -1.660853 -0.355361 0.415261
C  0.832163 -0.126827 -0.054904
C  -0.59265 0.084234 -0.612008
H  1.756087 -0.272409 -2.028688
H  1.729899 1.380332 -1.362354
H  -1.558137 0.231295 1.350202
H  -1.507935 -1.416729 0.690292
H  0.952901 0.456327 0.880023
H  0.976992 -1.191058 0.21187
H  -0.729694 1.15168 -0.873364
H  -0.727549 -0.502775 -1.538824
H  5.032507 1.092762 -1.307431
H  -4.150258 -1.139569 -1.53758
H  3.267345 3.436001 1.132738
H  5.884842 0.364732 0.836868
H  4.613702 -1.185201 -2.482038
H  5.59288 -2.178804 1.101515
H  -5.093474 0.788341 1.939479
H  -6.212518 -2.094263 -0.010148
H  -3.987777 2.89917 1.708811
H  -5.224144 2.307373 -1.774134
