program: Gaussian 09
title: 000103366
version: EM64L-G09RevD.01
frameworkgroup: C1[X(C18H31N)]
method: RPBEPBE
basis: SDD
operation: Freq
keyword: #pfreq=noraman
keyword: PBEPBE/SDD
title: #p freq=noraman PBEPBE/SDD
converged: NO YES NO NO
title: Mulliken charges:
elementType: N C C C C C C C C C C C C C C C C C C H H H H H H H H H H H H H H H H H H H H H H H H H H H H H H H
charge: -0.021045 0.003882 -0.003812 -0.491468 -0.489364 0.058365 -0.485848 -0.486278 -0.492955 -0.493411 -0.444740 -0.445389 -0.086085 -0.447321 -0.385517 -0.352965 -0.213067 -0.357961 -0.697087 0.199873 0.189375 0.190895 0.210926 0.209038 0.193494 0.187967 0.190913 0.206365 0.196713 0.195193 0.218957 0.228161 0.228579 0.219395 0.217225 0.206355 0.206158 0.217274 0.245890 0.195220 0.189752 0.202087 0.186641 0.186868 0.188824 0.194469 0.194624 0.209675 0.214949 0.210213
chargesum: 0.00000
title: Mulliken charges with hydrogens summed into heavy atoms:
elementType: N C C C C C C C C C C C C C C C C C C
charge: -0.021045 0.203755 0.185562 -0.089647 -0.086833 0.246332 -0.088570 -0.094372 -0.045838 -0.045437 -0.021160 -0.021957 0.159805 -0.062349 0.003211 0.022727 -0.213067 0.031132 -0.062250
polarizability: 2.41533171e+02 2.07176004e-02 1.67326172e+02 -2.48002071e+00 1.91550120e-01 1.67339130e+02
1716.lowfreq: -6.3872 -0.0013 -0.0012 -0.0006 3.5371 16.4294 22.0337 25.2750 38.5836
frequency: 16.6439 22.5600 37.9599 43.0480 49.9181 78.8380 109.8745 115.8406 132.5078 140.8226 155.8273 167.6389 201.2451 214.1414 227.8483 237.9115 241.3968 298.3156 311.0300 335.7021 365.7859 381.8375 399.8601 422.7083 423.5769 451.9461 467.8225 479.3527 519.1122 570.7597 598.5613 651.0433 721.1883 742.4231 774.1370 780.8947 786.8481 799.3464 810.3792 823.2945 871.7547 892.0018 896.1260 902.8058 923.4002 935.7940 936.2407 945.2613 962.0371 974.5154 1005.3465 1027.4015 1036.2394 1052.3389 1057.4561 1060.4724 1071.1629 1075.3264 1078.5764 1093.8706 1099.1604 1102.7877 1111.0999 1119.3164 1141.0128 1147.3705 1154.9799 1186.2431 1190.4334 1204.6950 1219.8827 1233.7247 1240.8421 1250.6529 1255.9176 1264.9044 1275.3199 1276.3604 1280.5027 1286.2020 1289.9654 1298.8244 1307.1467 1309.0346 1313.8889 1317.6675 1321.5158 1330.5538 1333.8538 1339.2519 1341.9605 1344.0425 1350.8590 1352.9713 1355.4697 1360.9605 1373.2455 1388.3254 1455.2068 1456.8422 1458.2903 1461.5523 1463.3955 1464.6442 1466.3674 1468.2244 1469.2599 1472.3894 1475.5237 1476.4850 1479.9840 1487.4318 2183.1014 2917.5656 2928.2762 2933.6509 2944.2520 2948.1218 2950.9262 2951.5631 2955.9607 2957.5333 2958.8762 2967.0342 2968.7428 2971.2689 2973.7464 2977.8164 2981.1610 2986.0344 2994.5513 2999.1904 3012.6396 3017.2552 3026.7372 3027.2004 3034.0389 3036.6007 3043.8378 3047.6871 3048.8005 3052.2212 3067.7541 3070.0289
redmass: 4.4122 2.1325 2.3568 3.3890 4.4952 3.6073 2.9636 1.7670 3.4221 3.7315 3.0914 3.8865 2.0736 2.5013 1.1248 2.1368 2.4781 4.3346 2.4400 2.9122 2.9445 1.8184 3.2272 3.1893 2.1723 2.7958 2.1795 2.7872 3.0033 5.0906 2.4596 2.7353 1.0788 1.2041 2.3885 1.5568 1.5229 2.6532 2.5271 1.4535 1.8891 1.8273 1.4261 2.3407 2.4053 1.4900 1.8243 1.6630 1.9119 2.1491 2.8583 2.7005 1.6088 2.1459 1.6796 1.6337 1.5265 2.0914 1.6363 1.8783 1.7019 1.9525 2.2895 2.4888 2.1510 2.0538 1.7046 1.4781 1.5640 1.5073 1.3170 1.3298 1.3430 1.1901 1.2729 1.2229 1.3678 1.2810 1.2244 1.1077 1.1932 1.2350 1.3417 1.3768 1.3504 1.2752 1.3492 1.4279 1.4104 1.4566 1.4854 1.6472 1.5841 1.4412 1.5675 1.5046 1.5044 1.2166 1.0802 1.0811 1.0883 1.0828 1.0733 1.0838 1.0799 1.0813 1.0838 1.0878 1.0873 1.0425 1.0773 1.0854 12.5434 1.0794 1.0806 1.0813 1.0593 1.0665 1.0590 1.0598 1.0671 1.0625 1.0609 1.0592 1.0643 1.0364 1.0654 1.0651 1.0615 1.0957 1.1004 1.0793 1.1003 1.1008 1.0958 1.0990 1.0993 1.1036 1.0945 1.0960 1.1016 1.1024 1.1007 1.0993
irintensity: 0.9898 0.4180 0.4701 0.6500 1.6084 0.8630 0.1888 0.0065 0.6059 2.3597 0.7092 0.5086 0.2963 0.3662 0.0012 0.0365 0.0936 0.2992 0.2790 0.0141 0.0324 0.6622 0.4023 0.0248 0.1735 0.0486 0.0441 0.7741 0.1565 0.2185 0.6253 0.1605 10.4640 0.5754 0.1556 0.0433 0.0038 0.6910 0.1412 3.9956 0.8377 11.8724 9.9124 4.5589 5.1658 6.1346 1.5803 2.0795 1.1206 14.4952 4.2457 0.8968 4.4696 0.0801 0.6725 0.1597 0.4920 0.9116 1.6098 0.6637 0.3993 10.9703 0.0330 0.3336 2.7461 0.3398 0.3188 0.5534 0.1989 0.1106 3.3202 2.1319 2.3450 1.5466 0.8446 7.4462 4.1152 0.8626 0.1078 1.8468 1.5891 1.2232 0.7050 0.5974 0.3266 0.7410 0.0496 0.2804 0.4786 0.0236 0.1955 0.2800 0.6078 5.2982 0.6034 7.7347 0.8429 11.5846 0.3493 6.0464 9.4430 1.7453 2.4365 0.7760 4.2572 13.9179 9.5160 2.2861 8.7568 12.2696 4.5603 18.9706 13.4669 2.9244 11.4942 7.7959 7.2803 28.8318 2.5020 7.0683 4.0061 36.8902 105.2497 118.4849 15.0186 39.6148 23.7479 32.0137 16.6028 3.6095 2.2868 55.8112 24.7970 24.2269 47.3173 3.8165 90.9361 149.3461 105.0251 2.2929 0.2723 66.5634 93.3988 54.5194
temp: 298.150 k
press: 1.00000 atm
elementType: 7 6 6 6 6 6 6 6 6 6 6 6 6 6 6 6 6 6 6 1 1 1 1 1 1 1 1 1 1 1 1 1 1 1 1 1 1 1 1 1 1 1 1 1 1 1 1 1 1 1
symmnumber: 1
zpe: 1187107.0 jmol-1
zpe.correction: 0.452145 hartree
zpe.thermalcorrener: 0.472985 hartree
zpe.thermalcorrenthalpy: 0.473929 hartree
zpe.thermalcorrgfe: 0.400276 hartree
zpe.sumelectzpe: -757.744866 hartree
zpe.sumelectthermal: -757.724026 hartree
zpe.sumelectthermalent: -757.723082 hartree
zpe.sumelectthermalfe: -757.796736 hartree
dipole: 1.4861 0.4968 -3.9361
dipole: 4.2365
quadrupole: -134.0989 -118.5603 -127.6673
quadrupole: -3.2399 23.1509 1.9942
quadrupole: -7.3234 8.2152 -0.8918 -3.2399 23.1509 1.9942
hfenergy: -758.1970113 hartree
pointgroup: C01 [X(C18H31N1)]
dipole: 0.6084212 -0.3214237 1.5181144 debye
polarizability: 241.5781959|0.7176852|167.2993246|1.5119529|0.2099362|167.3209525 unknown
InChI: InChI=1S/C18H31N/c1-2-3-4-5-15-6-10-17(11-7-15)18-12-8-16(14-19)9-13-18/h15-18H,2-13H2,1H3
charge 0 multiplicity 1
50 atoms
N  -5.799072 0.72352 -2.12531
C  -0.855043 -0.242453 0.009145
C  -2.282555 -0.171593 0.645213
C  0.09785 0.846479 0.575318
C  -0.19812 -1.637543 0.193784
C  2.170477 -0.624761 0.172283
C  1.522329 0.767298 -0.022961
C  1.22647 -1.708403 -0.404345
C  -3.234524 -1.254732 0.062709
C  -2.927634 1.231924 0.474648
C  -4.664359 -1.177675 0.643716
C  -4.355906 1.314781 1.058016
C  -5.299588 0.231897 0.454664
C  3.582106 -0.719988 -0.460667
C  4.651294 0.182563 0.197566
C  6.055875 0.011576 -0.424554
C  -5.577473 0.503797 -0.972696
C  7.130633 0.901726 0.240767
C  8.527175 0.743257 -0.398744
H  -0.966103 -0.061269 -1.084727
H  -2.173513 -0.365314 1.737907
H  0.15684 0.728312 1.679246
H  -0.30995 1.856639 0.383787
H  -0.819513 -2.423148 -0.274931
H  -0.152172 -1.868572 1.280108
H  2.269093 -0.805856 1.266924
H  1.474379 0.984977 -1.111729
H  2.152291 1.555823 0.431814
H  1.656319 -2.714893 -0.227193
H  1.166226 -1.579003 -1.506349
H  -2.835343 -2.265926 0.261244
H  -3.278731 -1.140234 -1.040466
H  -2.955095 1.488399 -0.604786
H  -2.308346 2.00147 0.969392
H  -5.308441 -1.949953 0.183795
H  -4.634766 -1.380285 1.733224
H  -4.32155 1.145561 2.15316
H  -4.780455 2.322709 0.895199
H  -6.274044 0.264276 0.982238
H  3.509256 -0.474533 -1.542018
H  3.926995 -1.774528 -0.405718
H  4.352619 1.247069 0.114799
H  4.701958 -0.044583 1.283539
H  6.365233 -1.05229 -0.351025
H  6.007275 0.245997 -1.508794
H  6.813142 1.962908 0.178971
H  7.187025 0.657298 1.321379
H  8.878712 -0.30357 -0.32844
H  9.277142 1.385779 0.098539
H  8.504781 1.017168 -1.470544
