program: Gaussian 09
title: 000103368
version: EM64L-G09RevD.01
frameworkgroup: C1[X(C24H21N5O)]
method: RPBEPBE
basis: SDD
operation: Freq
keyword: #p
keyword: freq=noraman
keyword: PBEPBE/SDD
title: #p freq=noraman PBEPBE/SDD
converged: YES YES NO NO
title: Mulliken charges:
elementType: O N N N N N C C C C C C C C C C C C C C C C C C C C C C C C H H H H H H H H H H H H H H H H H H H H H
charge: -0.263468 -0.248332 -0.169538 -0.070172 -0.343845 -0.035307 0.004781 0.186440 -0.428547 0.189111 0.343858 0.447006 -0.045540 -0.434408 0.156426 0.124233 -0.050686 0.487583 -0.537414 -0.452304 -0.399207 -0.373349 -0.376035 -0.366496 -0.349176 -0.256762 -0.226697 -0.663820 -0.662902 -0.262587 0.265621 0.265037 0.306572 0.279391 0.245698 0.237802 0.225711 0.217040 0.215160 0.232888 0.233081 0.252279 0.227288 0.227738 0.223056 0.242002 0.222342 0.249656 0.218322 0.226288 0.264183
chargesum: 0.00000
title: Mulliken charges with hydrogens summed into heavy atoms:
elementType: O N N N N N C C C C C C C C C C C C C C C C C C C C C C C C
charge: -0.263468 -0.248332 -0.169538 -0.070172 -0.079662 -0.035307 0.004781 0.186440 0.102110 0.189111 0.343858 0.447006 -0.045540 -0.127836 0.156426 0.124233 -0.050686 0.487583 -0.258023 -0.206606 -0.161405 0.069402 0.072013 -0.133416 -0.096897 -0.029474 0.001041 0.023580 0.031364 -0.262587
polarizability: 7.09537734e+02 -1.64104580e+01 3.90425060e+02 -1.10552914e+01 3.20923875e+00 1.36242724e+02
1716.lowfreq: -4.3452 -0.0008 -0.0004 0.0007 3.0761 6.2510 20.9890 31.3235 35.1132
frequency: 20.9293 31.2893 35.1080 55.4532 61.6238 75.5148 88.9461 96.4736 108.3308 111.4338 116.9998 153.2378 168.3453 191.4308 198.4128 204.8006 213.6280 235.1892 247.7653 270.9050 273.5749 285.4184 308.4001 313.3948 356.0820 361.4966 384.1921 409.1290 424.6118 438.8805 445.5160 451.3536 473.9822 486.2817 507.4058 522.0732 530.8745 552.2804 554.1731 573.4643 598.1270 604.5213 626.1437 629.1573 646.5879 652.7324 686.9750 690.2449 727.6423 732.3719 742.3564 754.0907 773.4599 774.4757 779.8470 784.4778 801.9982 803.4020 811.9019 851.3564 865.6253 873.4369 877.9962 917.3479 931.1455 937.9793 945.9444 946.4579 967.5456 983.6572 1002.7983 1017.8248 1022.9314 1029.6746 1066.5013 1077.7807 1084.8463 1093.3847 1100.7744 1114.6911 1122.1913 1152.9006 1158.5913 1168.4218 1189.2111 1196.6772 1198.3148 1206.1420 1235.2978 1236.6193 1261.0406 1268.9110 1284.2295 1288.2807 1299.0922 1326.8023 1339.6936 1346.2480 1354.6721 1370.5480 1384.8625 1387.9129 1390.1128 1394.6476 1408.3231 1425.9971 1449.3827 1463.0453 1467.0852 1472.1962 1476.3798 1480.7285 1487.3095 1488.0987 1492.5885 1506.2156 1516.2625 1522.9268 1531.3035 1548.4408 1582.0890 1588.9088 1600.0841 1618.8452 1654.6625 2157.8853 2983.3972 2990.3890 2992.6335 2997.4864 3000.5302 3020.8993 3050.2306 3057.1273 3086.5423 3089.6635 3097.5728 3101.8602 3116.2432 3133.1777 3138.8466 3152.0871 3161.8927 3166.8157 3180.3514 3191.1487 3369.7689
redmass: 4.2459 4.0520 4.7420 4.0550 4.5906 5.1761 5.3653 3.9131 5.5091 3.6434 4.5167 3.0840 2.0986 2.4967 2.1296 2.4805 1.4721 5.0011 5.5503 4.5054 2.6619 6.2995 7.1331 4.3431 5.2221 5.3040 4.8658 4.7114 4.5418 2.9907 3.0326 6.1993 3.7389 4.5712 3.5815 6.0455 3.9621 5.8711 4.8392 6.2667 7.1506 6.9195 5.1186 6.8643 5.5226 8.3313 5.1987 8.3575 2.0465 3.5074 5.2796 5.5856 5.0314 1.6368 1.3928 1.2218 1.2689 1.4286 2.8684 1.6466 4.1183 1.3560 3.5997 2.1597 5.1119 1.3376 1.4181 2.9068 1.4380 1.3232 1.8004 5.1669 2.7761 2.1436 2.1725 6.0567 1.9032 1.6810 1.8955 2.3008 2.1205 2.5004 1.9092 1.1119 2.0216 2.6027 1.7942 2.3073 1.0763 2.0401 2.6281 1.9054 1.2933 1.9301 1.3958 3.3339 1.2394 1.4501 2.8712 2.8295 2.0082 3.8302 1.4706 1.2174 2.9927 4.0615 2.6838 1.0996 1.9560 1.0596 1.3816 1.8609 1.0565 1.5661 1.1909 1.3013 3.3373 4.5489 6.5729 6.4024 7.1695 7.3184 8.4450 7.1413 8.2638 12.6142 1.0592 1.0357 1.0358 1.0613 1.0631 1.1024 1.1017 1.0999 1.0995 1.0988 1.1013 1.1012 1.0881 1.0881 1.0899 1.0938 1.0923 1.1000 1.0933 1.0912 1.0760
irintensity: 0.1083 0.1455 1.7997 0.0992 0.5667 0.8068 0.0600 0.2753 1.6702 1.2146 1.2972 0.2936 0.7271 0.0694 2.0284 4.0348 1.2287 4.3879 1.3006 2.2811 1.3014 2.9551 0.4868 2.8557 1.1621 0.9442 6.6493 0.9899 9.0566 16.3013 1.1767 1.0085 5.1069 6.5410 15.1004 0.3145 3.6156 0.1440 1.3184 3.8539 11.3423 9.3014 3.5190 4.2079 2.6722 1.5491 8.2941 0.2957 32.4677 0.2358 3.9529 0.8252 21.4938 53.1589 24.8310 9.5066 21.2040 84.3046 5.8247 41.8369 1.3457 1.4508 10.2823 0.7482 2.3970 3.0135 2.2640 8.2121 15.4068 0.2342 1.4434 11.2018 50.5390 12.2556 0.1151 0.8649 77.2330 26.9847 67.6832 29.0076 143.9783 108.5310 44.5782 8.9664 3.3275 45.0028 59.7009 14.0897 0.3997 7.2954 69.3475 33.6339 53.5812 12.5892 12.3308 205.5686 12.5677 383.8969 31.7367 44.1883 73.5199 26.1722 12.1099 35.2452 6.7349 92.0649 16.6311 10.9808 69.0628 5.0332 11.9390 21.7528 8.3396 89.4324 17.0728 27.1980 63.9077 694.7465 15.9619 44.1468 76.0550 24.9643 1213.8326 36.6729 403.4634 118.1939 9.4105 20.5734 38.4673 20.2322 119.6878 8.9920 2.7597 21.6616 53.8994 53.9254 6.5873 76.1427 10.4816 9.9751 4.8893 27.8338 1.4341 40.5781 20.2092 4.7357 27.1920
temp: 298.150 k
press: 1.00000 atm
elementType: 8 7 7 7 7 7 6 6 6 6 6 6 6 6 6 6 6 6 6 6 6 6 6 6 6 6 6 6 6 6 1 1 1 1 1 1 1 1 1 1 1 1 1 1 1 1 1 1 1 1 1
symmnumber: 1
zpe: 1048212.6 jmol-1
zpe.correction: 0.399243 hartree
zpe.thermalcorrener: 0.424829 hartree
zpe.thermalcorrenthalpy: 0.425773 hartree
zpe.thermalcorrgfe: 0.343101 hartree
zpe.sumelectzpe: -1274.036686 hartree
zpe.sumelectthermal: -1274.011100 hartree
zpe.sumelectthermalent: -1274.010156 hartree
zpe.sumelectthermalfe: -1274.092829 hartree
dipole: 8.3723 -6.1607 -0.0546
dipole: 10.3949
quadrupole: -115.6956 -191.9485 -180.4678
quadrupole: -4.5978 -1.6398 0.7538
quadrupole: 47.0083 -29.2445 -17.7638 -4.5978 -1.6398 0.7538
hfenergy: -1274.4359292 hartree
pointgroup: C01 [X(C24H21N5O1)]
dipole: -3.2466637 -2.4868182 0.013386 debye
polarizability: 708.8995316|22.5341244|391.1394881|-7.5949727|-4.4914528|136.1664989 unknown
InChI: InChI=1S/C24H21N5O/c1-3-28(4-2)17-10-9-15-11-18-22(30-21(15)12-17)19(13-25)23(26)29-14-16-7-5-6-8-20(16)27-24(18)29/h5-12,26H,3-4,14H2,1-2H3
charge 0 multiplicity 1
51 atoms
O  -1.358527 1.272184 0.127426
N  2.850673 1.055033 -0.028471
N  -5.783709 -0.675777 0.344488
N  2.721639 -1.366013 0.023257
N  3.04005 3.383995 -0.080782
N  -0.403302 4.723889 0.026187
C  2.152243 -0.169072 0.022669
C  0.677348 -0.108879 0.078546
C  4.345577 1.084483 -0.092894
C  0.037873 1.18101 0.077797
C  4.960634 -0.303479 -0.087002
C  -1.528294 -1.184137 0.180195
C  2.235882 2.338491 -0.028026
C  -0.099519 -1.264796 0.129409
C  -2.148995 0.104314 0.176703
C  0.756442 2.370363 0.028804
C  4.131246 -1.459381 -0.030204
C  -4.40344 -0.836072 0.270352
C  -3.52894 0.298264 0.214516
C  -2.410321 -2.303989 0.226102
C  -3.79697 -2.146965 0.264606
C  -6.691811 -1.846379 0.374722
C  -6.397768 0.673203 0.294662
C  6.361127 -0.454391 -0.139317
C  4.723859 -2.749466 -0.026797
C  6.949206 -1.741061 -0.13607
C  6.125017 -2.891099 -0.079526
C  -6.965464 -2.479506 -1.010489
C  -6.489977 1.281179 -1.125237
C  0.111103 3.640767 0.028183
H  4.707339 1.694582 0.756681
H  4.632216 1.653565 -0.998028
H  0.41989 -2.227837 0.128226
H  -3.898695 1.324597 0.200212
H  -1.980208 -3.311823 0.225938
H  -4.422054 -3.041987 0.288946
H  -6.28303 -2.606847 1.0661
H  -7.646089 -1.51021 0.818327
H  -7.41188 0.589345 0.724444
H  -5.835072 1.352632 0.962291
H  7.000103 0.436762 -0.183013
H  4.060192 -3.618846 0.017658
H  8.038917 -1.84422 -0.177049
H  6.575176 -3.889902 -0.076585
H  -7.460751 -1.760325 -1.685499
H  -6.029978 -2.809973 -1.494033
H  -7.626666 -3.358767 -0.901327
H  -5.495405 1.357387 -1.596883
H  -7.132255 0.667774 -1.780737
H  -6.922293 2.297092 -1.073343
H  2.51816 4.281086 -0.077337
