program: Gaussian 09
title: 000103246
version: EM64L-G09RevD.01
frameworkgroup: C1[X(C21H17NO4)]
method: RPBEPBE
basis: SDD
operation: Freq
keyword: #p
keyword: freq=noraman
keyword: PBEPBE/SDD
title: #p freq=noraman PBEPBE/SDD
converged: YES YES NO NO
title: Mulliken charges:
elementType: O O O O N C C C C C C C C C C C C C C C C C C C C C H H H H H H H H H H H H H H H H H
charge: -0.304486 -0.304380 -0.254274 -0.253326 -0.188600 0.236987 0.134176 0.134225 0.203529 0.063759 0.063931 -0.570692 0.153047 0.153674 -0.372006 -0.372465 -0.365551 -0.365385 0.488870 -0.383993 -0.380956 -0.235243 -0.236323 -0.519755 -0.520392 -0.236919 0.249088 0.250713 0.280965 0.281024 0.262405 0.262386 0.264563 0.267540 0.223863 0.223788 0.263504 0.233986 0.222199 0.264562 0.221583 0.234139 0.226242
chargesum: 0.00000
title: Mulliken charges with hydrogens summed into heavy atoms:
elementType: O O O O N C C C C C C C C C C C C C C C C C C C C C
charge: -0.304486 -0.304380 -0.254274 -0.253326 -0.188600 0.236987 0.134176 0.134225 0.203529 0.063759 0.063931 -0.070892 0.153047 0.153674 -0.091042 -0.091441 -0.103146 -0.102999 0.488870 -0.119430 -0.113416 -0.011380 -0.012535 0.199933 0.199892 -0.010676
chargesum: -0.00003
polarizability: 3.50396373e+02 2.27412030e-01 2.69540437e+02 -9.21562232e+00 9.48574720e+00 1.56221648e+02
1716.lowfreq: -16.7639 -5.1749 -1.1503 -0.5700 -0.0198 4.0263 21.9942 25.0860 39.8505
frequency: 21.7619 24.9523 39.8344 52.3890 70.3158 89.3181 108.6878 125.1253 133.6214 147.4923 151.4559 169.2424 179.4964 206.5434 208.4262 238.5337 260.8210 280.3174 298.6954 336.5324 348.7344 374.5813 382.1568 405.2920 405.8786 416.9495 424.7572 469.4693 476.2559 481.7702 500.0569 524.5774 566.8814 589.1493 609.5739 617.8357 618.7613 655.7840 664.7895 707.5711 732.3152 738.0262 748.3189 761.8041 766.3913 791.6116 804.3803 825.4770 862.9713 872.3973 873.6966 883.2358 906.1624 939.8406 949.5326 967.6908 981.1474 987.3141 989.9886 993.0891 993.4564 1000.1185 1027.7812 1076.1089 1077.6194 1107.3738 1109.1708 1116.0332 1133.5674 1149.6749 1157.4930 1167.5342 1172.1174 1182.5060 1189.4170 1206.8543 1211.4974 1231.9257 1243.0138 1298.4051 1313.4998 1344.9915 1347.1525 1359.3701 1369.9251 1381.2425 1385.9381 1421.5163 1423.7000 1436.3704 1444.4466 1452.8557 1453.3605 1456.4278 1457.8278 1477.4787 1480.0828 1484.1848 1523.3490 1552.9348 1568.0999 1584.3628 1593.9399 1607.8641 1611.9945 1613.5572 2977.2770 2978.7807 3051.5552 3085.1424 3087.0867 3114.3676 3121.1376 3127.1012 3127.8908 3130.5578 3142.2536 3150.8666 3153.8919 3157.2924 3163.1704 3175.6953 3181.8694
redmass: 4.7199 5.6980 4.2150 4.5300 4.7603 7.5598 5.9018 2.2085 2.1039 1.1474 1.4606 3.7737 5.8135 4.7140 5.0522 4.6353 6.3883 6.6895 7.5748 6.7014 7.4288 7.2098 5.8084 3.5550 3.6837 2.8629 4.2837 4.8090 4.6615 4.4123 8.6916 4.2897 6.2920 5.8547 7.6525 6.1768 5.6133 5.9500 3.9522 1.8424 6.6941 6.7556 4.2990 2.2412 4.9408 6.1975 7.0689 3.7628 1.2488 2.1145 1.4838 2.1612 6.1014 1.5975 3.7090 5.7001 3.8893 1.3797 5.4566 1.3853 1.3812 1.3473 2.2408 1.9350 1.8999 1.2837 1.2500 2.4276 1.6997 1.3550 1.4900 2.8769 1.0567 1.5895 1.1245 2.3384 2.9171 2.3968 3.8864 2.7163 1.7261 1.4547 3.0947 1.7988 8.3105 3.1738 5.4232 1.5645 1.5219 2.4907 2.1308 1.1918 1.2514 1.1215 1.4206 1.0544 1.0570 2.2270 5.3990 10.2912 6.8770 7.5036 6.0616 8.8733 9.4519 6.0505 1.0316 1.0316 1.0584 1.1024 1.1028 1.1056 1.0846 1.1034 1.1033 1.0881 1.0928 1.0966 1.0893 1.0886 1.1016 1.0965 1.0957
irintensity: 0.2368 0.6195 0.0060 0.1314 0.0686 0.2558 2.9702 7.2549 10.2781 0.8742 3.3889 3.3187 2.7539 1.5990 0.4239 3.9880 2.3303 10.1942 9.5358 3.7057 13.2703 2.5317 16.2825 14.4241 13.6774 6.1911 4.0536 1.7072 2.6939 39.1593 2.4282 9.0421 3.0923 11.7668 6.0114 0.2873 11.1447 6.0842 0.4775 65.5821 20.1940 7.9751 54.3487 24.8468 0.0777 0.0751 0.7237 10.0705 0.8826 9.8126 6.8957 50.8592 16.1389 29.5324 41.2567 24.9978 58.9476 1.5156 0.0130 0.3602 2.8378 1.5001 8.8802 91.1269 91.3137 4.8210 14.0451 11.6540 21.5887 7.0545 9.2102 9.5261 0.0035 2.4390 7.6370 11.9682 7.0135 233.5367 87.5332 157.4782 45.7550 15.4152 201.4370 40.5660 5.9491 121.3852 4.8493 1.2943 1.9301 31.6543 7.2398 53.9036 11.6737 6.6810 11.3809 11.4133 16.0954 27.0024 26.0322 192.5444 46.6575 514.7343 0.6116 1.1629 98.6915 7.1404 98.1607 58.0007 19.3743 22.8975 7.1312 0.0391 0.1216 12.0146 31.7965 7.9981 18.4929 20.3757 0.7021 0.8952 25.5504 3.9938 5.5649
temp: 298.150 k
press: 1.00000 atm
elementType: 8 8 8 8 7 6 6 6 6 6 6 6 6 6 6 6 6 6 6 6 6 6 6 6 6 6 1 1 1 1 1 1 1 1 1 1 1 1 1 1 1 1 1
symmnumber: 1
zpe: 865401.6 jmol-1
zpe.correction: 0.329614 hartree
zpe.thermalcorrener: 0.351770 hartree
zpe.thermalcorrenthalpy: 0.352714 hartree
zpe.thermalcorrgfe: 0.277216 hartree
zpe.sumelectzpe: -1164.283257 hartree
zpe.sumelectthermal: -1164.261100 hartree
zpe.sumelectthermalent: -1164.260156 hartree
zpe.sumelectthermalfe: -1164.335654 hartree
dipole: -4.9012 -0.2628 1.4650
dipole: 5.1222
quadrupole: -133.7394 -147.9281 -146.6711
quadrupole: -1.4504 3.5418 -4.6628
quadrupole: 9.0401 -5.1485 -3.8916 -1.4504 3.5418 -4.6628
hfenergy: -1164.6128707 hartree
pointgroup: C01 [X(C21H17N1O4)]
dipole: -1.9239058 0.0975008 -0.591841 debye
polarizability: 350.2352808|-0.0317272|269.5055289|10.7546966|9.7209701|156.4176477 unknown
InChI: InChI=1S/C21H17NO4/c1-25-16-10-8-14-18-15(9-11-17(26-2)19(16)18)21(24)22(20(14)23)12-13-6-4-3-5-7-13/h3-11H,12H2,1-2H3
charge 0 multiplicity 1
43 atoms
O  -4.537307 1.534146 -0.620466
O  -4.643758 -1.3394 -0.709367
O  1.555822 2.126191 1.440844
O  1.545315 -2.491021 0.742999
N  1.544906 -0.180232 1.076985
C  -1.216368 -0.05624 0.299426
C  -0.513463 1.136102 0.672303
C  -0.526166 -1.312265 0.325646
C  -2.612776 0.007893 -0.098374
C  0.912629 1.090793 1.08672
C  0.905113 -1.395607 0.716457
C  2.991391 -0.241484 1.464846
C  -3.215164 1.321122 -0.187627
C  -3.281027 -1.247261 -0.37051
C  -1.166244 2.377454 0.648993
C  -1.196629 -2.493492 -0.0252
C  -2.507614 2.46641 0.208625
C  -2.570938 -2.457792 -0.358228
C  3.932731 -0.056982 0.278388
C  4.401803 -1.182022 -0.447141
C  4.359183 1.241215 -0.103267
C  5.282036 -1.01094 -1.539212
C  5.23887 1.411329 -1.195683
C  -4.785461 1.350697 -2.071249
C  -5.611107 -1.094525 0.38763
C  5.703294 0.285843 -1.916047
H  3.141607 -1.22824 1.930467
H  3.141626 0.557689 2.207962
H  -0.604701 3.267685 0.948875
H  -0.639218 -3.435169 -0.006425
H  -3.02024 3.430411 0.143657
H  -3.120455 -3.373227 -0.595544
H  4.063174 -2.183104 -0.15671
H  3.987759 2.108723 0.453961
H  5.640686 -1.886012 -2.093095
H  5.56422 2.417858 -1.482467
H  -4.624154 0.3001 -2.366166
H  -5.840978 1.624688 -2.217471
H  -4.134482 2.032465 -2.650423
H  -5.561278 -0.045652 0.725184
H  -5.415083 -1.793327 1.222677
H  -6.598339 -1.302658 -0.051383
H  6.388083 0.417839 -2.761689
