program: Gaussian 09
title: 000103313
version: EM64L-G09RevD.01
frameworkgroup: C1[X(C18H17N3O7S2)]
method: RPBEPBE
basis: SDD
operation: Freq
keyword: #p
keyword: freq=noraman
keyword: PBEPBE/SDD
title: #p freq=noraman PBEPBE/SDD
converged: YES YES NO NO
title: Mulliken charges:
elementType: S S O O O O O O O N N N C C C C C C C C C C C C C C C C C C H H H H H H H H H H H H H H H H H
charge: 0.964943 0.990636 -0.556912 -0.563054 -0.492552 -0.494399 -0.497897 -0.490851 -0.273630 -0.163412 -0.066448 -0.674549 0.525678 0.434952 -0.255815 -0.092626 -0.429079 -0.278977 -0.438693 -0.411816 0.171901 -0.375271 0.015208 0.358076 -0.518391 0.372300 0.313293 -0.548803 -0.836352 -0.524259 0.296859 0.333502 0.319033 0.254265 0.260978 0.266772 0.248969 0.382287 0.226407 0.254955 0.229054 0.385238 0.321650 0.337069 0.276308 0.231566 0.211888
chargesum: 0.00000
title: Mulliken charges with hydrogens summed into heavy atoms:
elementType: S S O O O O O O O N N N C C C C C C C C C C C C C C C C C C
charge: 0.964943 0.990636 -0.174625 -0.177816 -0.492552 -0.494399 -0.497897 -0.490851 -0.273630 -0.163412 -0.066448 -0.015830 0.525678 0.434952 -0.255815 -0.092626 -0.132219 0.054525 -0.119660 -0.157551 0.171901 -0.114293 0.015208 0.358076 -0.251620 0.372300 0.313293 -0.299834 -0.125937 0.195502
polarizability: 7.71851907e+02 -3.16513708e+01 3.24080310e+02 7.65204111e+00 -6.19649957e+00 1.66832467e+02
1716.lowfreq: -6.5639 -3.5708 -1.9320 -0.0016 0.0006 0.0013 8.4275 16.8916 25.3576
frequency: 7.6366 16.8849 25.3207 28.6864 40.9010 42.6715 72.7211 80.6050 84.0296 91.6048 106.1873 119.5896 126.2634 153.8025 158.5407 164.4298 173.2962 180.3613 186.0951 193.5809 202.0543 210.1912 236.1611 238.9411 248.6161 253.3913 269.6268 283.4189 298.1818 302.4062 312.0624 319.0320 326.8923 334.9172 347.4501 393.1196 396.1157 417.3098 422.5606 423.1978 429.9984 440.5690 444.6418 475.0834 488.4394 496.3141 514.7332 522.2552 535.4104 539.2594 558.8125 592.1156 598.0205 605.5674 671.6527 680.2048 688.1648 698.0467 723.8938 742.1827 790.8483 801.8727 804.4628 830.5524 835.1146 840.0630 846.0724 867.0936 903.1910 919.4259 920.7075 936.6858 941.6996 947.6747 962.8744 966.3537 974.2176 993.0064 999.7213 1046.5876 1047.3516 1048.3199 1049.7283 1079.7618 1105.5588 1108.0141 1131.2543 1148.4632 1158.5098 1177.4372 1195.9941 1222.4249 1228.9055 1254.8335 1279.4805 1313.8345 1322.8475 1334.3505 1363.9257 1389.1624 1398.7155 1409.5754 1414.3072 1425.1973 1428.3628 1439.2924 1451.8718 1475.6784 1479.7417 1491.8560 1505.9434 1512.3052 1535.6597 1555.1448 1589.0216 1615.0256 1635.6596 1649.7581 2957.5727 2962.8728 3025.3933 3064.1253 3094.4879 3121.1629 3141.4047 3145.1034 3146.9490 3147.4978 3150.7758 3168.0861 3175.6433 3478.3280 3479.5878 3556.3630 3695.6916
redmass: 5.0036 7.6675 8.7187 6.6396 9.6097 4.6404 5.1559 4.7213 10.1572 3.3080 4.7184 5.3785 4.7908 2.4444 1.9568 2.0946 2.9175 2.4185 1.6583 2.9824 2.7052 2.2013 5.4827 4.5838 4.9461 4.1913 5.5961 4.1275 3.7766 4.1916 6.3259 7.8085 8.4995 9.1909 4.9200 7.8664 5.1791 3.6268 6.3276 5.8834 3.5863 6.0765 1.3303 4.0334 1.3279 4.2310 6.4181 6.5662 7.1604 6.7828 6.7759 4.7280 4.0988 5.9598 7.7013 5.0539 4.8752 5.8156 7.1352 2.7797 5.1238 2.8893 4.6325 7.1352 11.6374 3.2546 1.9810 1.7443 5.6389 1.3773 1.4250 2.0328 3.8841 1.6199 12.1610 6.5593 5.4360 1.3904 1.5428 1.5028 1.4259 1.1774 1.1770 1.9770 2.0424 1.2906 2.8136 1.4374 1.5996 2.4907 2.8272 2.0232 2.0475 1.5448 1.8718 2.3218 2.9385 6.8203 2.9418 3.4327 1.2886 2.1166 3.7417 2.8613 5.2345 1.9099 1.2436 1.0464 1.3435 1.0607 4.2667 4.3114 5.2783 8.1347 7.1767 6.9816 2.3438 1.7729 1.0398 1.0309 1.0977 1.1050 1.0952 1.1014 1.0888 1.0927 1.0911 1.0929 1.0920 1.0972 1.0916 1.0661 1.0661 1.0452 1.1037
irintensity: 0.3432 0.4168 1.5528 0.7230 0.3664 2.2212 0.7455 0.8264 0.0990 2.0684 2.6543 0.7376 1.7991 2.7660 48.2672 45.4260 1.2195 0.7903 1.3917 3.0268 16.8348 3.2755 24.8926 1.0114 9.7058 69.2062 20.6896 43.6123 1.5300 5.7373 10.2447 4.8499 11.8598 15.0169 6.0176 25.4354 8.9938 10.9166 55.6388 94.3810 10.6792 21.2945 137.7792 4.0120 125.7759 9.6959 5.5420 60.7748 169.9175 87.9027 80.5133 11.8273 28.8954 16.3756 20.0393 22.0919 3.3622 4.3023 25.1326 1.9871 2.6736 1.1861 15.8119 118.8349 49.6439 20.7883 27.4644 32.7295 3.8089 4.3903 26.9464 13.0810 34.9346 27.1461 78.4557 87.1397 29.3612 0.4932 37.7865 6.0448 1.1316 25.6194 152.1957 84.8680 214.5387 15.4497 48.3864 26.7811 3.4920 146.0418 101.1406 4.8214 102.5799 59.5821 9.4756 47.7969 10.1404 1379.3884 68.7278 11.1615 17.0631 161.6998 7.0493 2.9365 30.4405 6.5335 19.4230 14.5847 12.3277 9.5045 91.8762 67.6079 298.7725 27.8617 19.8178 270.6635 45.1200 639.2972 60.3989 86.5826 23.3710 11.5312 6.1177 17.1559 4.3359 31.6443 11.5898 8.0716 7.2977 8.1433 2.8456 37.6949 57.3330 299.1592 30.0748
temp: 298.150 k
press: 1.00000 atm
elementType: 16 16 8 8 8 8 8 8 8 7 7 7 6 6 6 6 6 6 6 6 6 6 6 6 6 6 6 6 6 6 1 1 1 1 1 1 1 1 1 1 1 1 1 1 1 1 1
symmnumber: 1
zpe: 857404.1 jmol-1
zpe.correction: 0.326568 hartree
zpe.thermalcorrener: 0.357611 hartree
zpe.thermalcorrenthalpy: 0.358556 hartree
zpe.thermalcorrgfe: 0.261621 hartree
zpe.sumelectzpe: -2180.488760 hartree
zpe.sumelectthermal: -2180.457716 hartree
zpe.sumelectthermalent: -2180.456772 hartree
zpe.sumelectthermalfe: -2180.553707 hartree
dipole: -11.9247 -1.7287 2.8402
dipole: 12.3795
quadrupole: -138.3856 -188.0817 -193.1101
quadrupole: -21.6628 14.3150 0.6029
quadrupole: 34.8069 -14.8893 -19.9176 -21.6628 14.3150 0.6029
hfenergy: -2180.8153279 hartree
pointgroup: C01 [X(C18H17N3O7S2)]
dipole: 4.5476381 1.0133646 -1.4190328 debye
polarizability: 772.8515413|25.5243062|178.3929741|-12.18715|39.0230526|311.520168 unknown
InChI: InChI=1S/C18H17N3O7S2/c1-10-5-16(17(28-2)9-15(10)19)21-20-12-4-3-11-6-13(29(22,23)24)8-18(14(11)7-12)30(25,26)27/h3-9,22,25H,19H2,1-2H3
charge 0 multiplicity 1
47 atoms
S  -1.717709 0.860887 2.781771
S  -6.44623 -0.915823 0.472514
O  -1.335156 2.454723 1.904771
O  -6.886277 0.789475 -0.120459
O  -2.834891 1.124341 3.920145
O  -0.311586 0.174191 3.195825
O  -6.931836 -1.997963 -0.626959
O  -6.894713 -1.044582 2.020996
O  4.34607 -0.437621 -2.842522
N  1.680865 -0.595104 -1.388729
N  2.35867 -0.226406 -0.315581
N  7.950528 -0.294922 0.287429
C  -1.784606 -0.374036 0.152182
C  -2.552563 -0.984717 -0.931028
C  -2.548596 0.05084 1.292139
C  -4.599819 -0.684129 0.340305
C  -3.967229 -1.126331 -0.813798
C  -3.923865 -0.076036 1.426338
C  -0.374913 -0.242695 0.023062
C  -1.86106 -1.426043 -2.107613
C  0.272544 -0.690447 -1.146042
C  -0.483868 -1.277668 -2.216343
C  3.750585 -0.118534 -0.383985
C  5.695898 0.029157 1.188931
C  4.329049 0.071665 0.919037
C  6.583424 -0.216548 0.079679
C  4.673844 -0.282781 -1.495097
C  6.052972 -0.350397 -1.232537
C  6.244015 0.204482 2.591684
C  3.439352 0.543034 -3.476324
H  -4.548304 -1.593328 -1.616893
H  -4.449403 0.258286 2.328031
H  0.233731 0.190412 0.820481
H  -2.438674 -1.882935 -2.91839
H  0.062805 -1.610623 -3.104074
H  3.610298 0.209724 1.734186
H  6.718858 -0.485989 -2.091752
H  -0.815342 3.028511 2.540267
H  6.931431 1.071512 2.663886
H  5.42783 0.375398 3.311851
H  6.798286 -0.692798 2.934043
H  -7.870848 0.912667 0.017208
H  8.583938 -0.485385 -0.484913
H  8.346719 -0.178439 1.215976
H  2.416215 0.413074 -3.082584
H  3.479835 0.304426 -4.549778
H  3.810624 1.570372 -3.300933
