program: Gaussian 09
title: 000103062
version: EM64L-G09RevD.01
frameworkgroup: C1[X(C17H16N2O2)]
method: RPBEPBE
basis: SDD
operation: Freq
keyword: #p
keyword: freq=noraman
keyword: PBEPBE/SDD
title: #p freq=noraman PBEPBE/SDD
converged: NO YES NO NO
title: Mulliken charges:
elementType: O O N N C C C C C C C C C C C C C C C C C H H H H H H H H H H H H H H H H
charge: -0.325654 -0.326091 -0.396795 -0.386132 0.122019 0.143814 0.256442 0.287932 0.286487 0.251598 -0.165768 -0.155307 -0.378840 -0.374900 -0.394296 -0.393249 -0.335184 -0.232303 -0.232408 -0.710808 -0.649716 0.247274 0.243426 0.385298 0.291057 0.290963 0.376140 0.216112 0.215913 0.232915 0.233050 0.230252 0.230024 0.220866 0.239284 0.228239 0.228347
chargesum: 0.00000
title: Mulliken charges with hydrogens summed into heavy atoms:
elementType: O O N N C C C C C C C C C C C C C C C C C
charge: -0.325654 -0.326091 -0.011497 -0.009993 0.122019 0.143814 0.256442 0.287932 0.286487 0.251598 -0.165768 -0.155307 -0.131566 -0.131473 -0.103239 -0.102286 0.096841 0.000612 0.000642 -0.029665 0.046154
polarizability: 3.53282282e+02 3.62784558e+01 2.96917701e+02 -8.07235738e-02 3.90532394e-02 9.21793888e+01
1716.lowfreq: -11.3374 -8.7353 -5.5612 -0.0008 -0.0005 0.0002 38.6705 52.4223 70.3930
frequency: 38.5529 52.3978 70.3893 97.7819 107.5212 123.0342 154.2474 169.2026 172.2402 184.2898 194.9173 246.5511 250.4455 284.1492 292.1823 322.7090 335.6020 360.3702 386.1227 415.8163 425.7528 427.4695 429.8824 470.1043 502.9207 506.3101 565.1074 585.7862 621.8644 657.8312 664.5050 704.4201 723.6808 731.6016 753.8005 802.3257 805.6230 822.0965 836.1467 845.2288 851.7806 861.9869 874.7096 911.4835 928.0982 951.9741 953.7631 994.2047 1010.5981 1019.0872 1046.2484 1077.9333 1086.0700 1099.0725 1110.8664 1136.9712 1151.2457 1157.8839 1166.8384 1168.8923 1190.0545 1246.1221 1266.5434 1267.2150 1300.5109 1319.7645 1331.0257 1354.2686 1371.2217 1384.5085 1386.7162 1400.1288 1405.4773 1436.2538 1454.3363 1461.6883 1473.7503 1474.8893 1476.8292 1481.8056 1491.7679 1492.9362 1500.4443 1542.2530 1552.1499 1582.6198 1594.4750 1609.5466 1644.1294 2938.1031 2949.3949 2979.1345 2992.0268 3016.8822 3089.7320 3096.2489 3096.4847 3102.7816 3109.2300 3131.3471 3147.4193 3149.4239 3164.1584 3170.2755 3171.4870
redmass: 3.2748 4.5783 3.7304 2.3827 3.5026 3.3029 2.1954 3.0116 3.5390 3.1761 2.1515 1.4186 3.8385 3.6170 4.7127 5.0568 4.5046 4.5836 9.4706 4.7013 6.1357 3.3818 11.9771 9.9533 6.5077 4.6924 3.0793 5.2004 5.7973 5.9266 4.7642 6.4676 2.3436 5.4836 5.2797 1.4991 1.4327 1.5062 5.3958 1.1305 2.7468 4.8063 1.1057 3.4578 1.8556 3.4542 1.3387 1.3869 1.3541 2.9829 2.3763 2.4948 2.5082 2.1106 1.2815 1.4846 2.3107 2.2442 1.1811 2.1276 1.4307 1.6543 1.1194 2.0303 2.4412 1.9839 3.7260 1.5449 7.4818 2.6323 6.2273 1.2375 8.7395 1.3965 3.1831 2.4959 1.0427 1.0392 2.1400 1.1340 1.2270 1.3993 3.0749 4.4866 2.6429 2.3414 3.8177 6.4654 6.0318 1.0575 1.0381 1.1037 1.0360 1.1005 1.1009 1.0931 1.0971 1.0892 1.0835 1.0861 1.0862 1.0908 1.0942 1.0966 1.0991
irintensity: 0.2273 7.7963 0.2441 0.5531 0.1220 0.0234 0.1974 0.0347 0.0978 0.5706 0.0150 0.0612 1.2004 1.7126 2.8013 6.0232 1.7179 0.0018 1.1111 7.0738 0.0008 2.7388 10.2618 16.4808 8.5987 0.0044 27.5411 3.5899 0.1405 8.8074 0.0038 4.8695 17.3167 0.0439 3.4631 99.0754 0.2125 43.5940 1.7420 51.0887 3.2387 12.8023 96.2041 1.8237 0.1383 14.7788 0.0184 5.5242 0.0035 53.5417 12.7270 1.1151 8.4428 4.2114 2.7768 1.7203 11.6805 15.0931 0.6954 6.2299 55.9555 2.5154 0.3924 78.5492 73.2418 51.9522 559.5146 36.6401 2.5876 43.0546 6.0330 20.1781 15.0714 23.4694 0.9398 17.5991 13.8121 12.8351 43.0054 30.3077 3.7810 57.1690 12.0190 529.5910 53.6429 75.2016 83.9844 0.0646 140.3840 94.9636 156.0561 35.3455 27.6321 44.4399 35.3604 63.5509 9.1756 10.4280 11.0532 4.9796 5.0377 17.6060 2.5445 25.5664 27.6654
temp: 298.150 k
press: 1.00000 atm
elementType: 8 8 7 7 6 6 6 6 6 6 6 6 6 6 6 6 6 6 6 6 6 1 1 1 1 1 1 1 1 1 1 1 1 1 1 1 1
symmnumber: 1
zpe: 768590.2 jmol-1
zpe.correction: 0.292741 hartree
zpe.thermalcorrener: 0.310787 hartree
zpe.thermalcorrenthalpy: 0.311732 hartree
zpe.thermalcorrgfe: 0.247003 hartree
zpe.sumelectzpe: -915.930948 hartree
zpe.sumelectthermal: -915.912901 hartree
zpe.sumelectthermalent: -915.911957 hartree
zpe.sumelectthermalfe: -915.976686 hartree
dipole: 3.9386 1.9341 -0.0067
dipole: 4.3879
quadrupole: -99.7210 -108.2675 -127.4889
quadrupole: 8.2047 -0.0015 -0.0064
quadrupole: 12.1048 3.5583 -15.6631 8.2047 -0.0015 -0.0064
hfenergy: -916.2236889 hartree
pointgroup: C01 [X(C17H16N2O2)]
dipole: 1.654153 -0.4939248 0.0026929 debye
polarizability: 363.5834151|-25.0877146|286.6165907|0.0606557|-0.0226353|92.1793662 unknown
InChI: InChI=1S/C17H16N2O2/c1-3-19-13-9-8-12(18-2)14-15(13)17(21)11-7-5-4-6-10(11)16(14)20/h4-9,18-19H,3H2,1-2H3
charge 0 multiplicity 1
37 atoms
O  0.136408 2.640594 -0.000147
O  -1.757731 -2.572226 -0.002109
N  2.574237 1.802386 0.000206
N  0.633971 -3.494016 0.000473
C  0.656619 0.270914 0.000674
C  0.160739 -1.088905 0.000545
C  2.079801 0.520332 0.000446
C  -1.730135 1.126496 0.000233
C  -2.217451 -0.212649 -0.000167
C  1.088087 -2.196257 0.000416
C  -0.273766 1.402979 0.001017
C  -1.278787 -1.359035 0.000365
C  2.975173 -0.608646 0.000783
C  2.499738 -1.910986 0.000725
C  -2.649568 2.208211 -0.000365
C  -3.616911 -0.451534 -0.001223
C  3.99857 2.15453 -0.000151
C  -4.034163 1.961963 -0.001307
C  -4.520035 0.626333 -0.001755
C  4.166359 3.683383 -0.008736
C  1.492526 -4.674899 0.00002
H  4.055148 -0.435484 0.001681
H  3.213137 -2.740511 0.001307
H  1.826729 2.534858 0.002316
H  -2.245523 3.224948 -0.000068
H  -3.959826 -1.490489 -0.001563
H  -0.410356 -3.561545 0.001474
H  4.501045 1.730219 0.895081
H  4.502778 1.720247 -0.889495
H  -4.740073 2.799708 -0.001737
H  -5.599181 0.437908 -0.002549
H  3.701075 4.127173 -0.906902
H  3.697662 4.137694 0.882417
H  5.236925 3.951821 -0.008113
H  0.853762 -5.572393 0.000238
H  2.142449 -4.720384 0.897001
H  2.141667 -4.720236 -0.89753
