program: Gaussian 09
title: 000103180
version: EM64L-G09RevD.01
frameworkgroup: C1[X(C20H18BrN5O6)]
method: RPBEPBE
basis: SDD
operation: Freq
keyword: #p
keyword: freq=noraman
keyword: PBEPBE/SDD
title: #p freq=noraman PBEPBE/SDD
converged: YES YES NO NO
title: Mulliken charges:
elementType: Br O O O O O O N N N N N C C C C C C C C C C C C C C C C C C C C H H H H H H H H H H H H H H H H H H
charge: 0.053532 -0.305657 -0.454238 -0.199273 -0.183471 -0.208225 -0.209628 -0.389864 -0.079735 -0.095077 0.012394 0.015332 0.258545 0.300739 0.268058 -0.368776 -0.060019 -0.379942 -0.366721 -0.297817 -0.366863 -0.275385 -0.262489 -0.239197 -0.205026 0.231447 0.403015 -0.311291 -0.354780 -0.507442 0.441791 -0.377124 0.344496 0.220742 0.249777 0.238985 0.203170 0.281616 0.297142 0.205993 0.214514 0.232066 0.242576 0.220197 0.188388 0.192834 0.202734 0.316481 0.308301 0.353173
chargesum: 0.00000
title: Mulliken charges with hydrogens summed into heavy atoms:
elementType: Br O O O O O O N N N N N C C C C C C C C C C C C C C C C C C C C
charge: 0.053532 -0.305657 -0.101064 -0.199273 -0.183471 -0.208225 -0.209628 -0.045367 -0.079735 -0.095077 0.012394 0.015332 0.258545 0.300739 0.268058 0.101742 -0.060019 -0.140957 -0.163551 -0.016201 -0.069720 0.145122 -0.030423 0.003379 0.203559 0.231447 0.403015 0.084277 -0.354780 -0.190961 0.441791 -0.068824
polarizability: 8.50362137e+02 1.79753990e+01 3.49763954e+02 2.39943635e+01 -1.24213074e+01 1.57042512e+02
1716.lowfreq: -3.2853 -2.7695 -0.0007 -0.0006 0.0010 0.5714 9.2110 11.6052 19.7632
frequency: 9.1271 11.4878 19.7433 23.4643 28.1958 47.0765 51.3222 59.8282 62.2604 82.6162 86.5336 92.3395 97.2421 110.6974 118.8700 140.0475 143.2139 165.0139 171.1343 180.6661 185.1123 191.6194 199.0788 216.2916 257.4962 266.4169 281.4373 291.4811 309.5865 316.0043 336.9055 365.1566 372.1759 389.5516 414.5783 426.2367 452.6016 469.4480 483.4189 484.6125 512.7807 516.4293 527.5264 555.4484 576.1169 590.3391 604.3606 622.3914 650.0803 667.3897 677.4906 679.6264 694.0913 700.2617 729.4351 756.4481 763.4506 768.4657 784.6591 792.6455 795.4266 803.4972 835.1614 851.0758 866.5464 880.0305 901.6915 906.4084 923.9559 932.6244 936.4396 964.6190 986.3410 1012.8670 1013.2443 1029.8381 1042.9197 1046.7930 1050.3999 1059.4713 1061.9015 1076.5878 1094.6199 1122.4178 1140.4216 1158.5162 1179.0085 1180.7563 1188.2562 1190.3176 1197.2663 1200.5305 1213.1280 1224.4511 1229.6040 1244.4736 1258.7915 1264.5274 1293.2583 1315.4561 1324.2030 1342.6729 1345.3006 1356.4814 1365.6840 1366.3336 1373.4309 1391.9478 1403.9925 1410.2846 1418.3170 1419.8310 1420.7374 1441.8663 1455.4401 1462.2925 1463.4979 1470.2569 1481.7900 1509.2219 1542.5193 1545.3639 1553.1801 1582.5325 1598.2629 1622.0161 2938.8531 2942.9702 2955.2556 2972.6960 3002.9764 3009.5287 3018.2539 3048.3867 3120.6610 3143.1217 3154.3697 3160.7334 3173.1455 3176.5344 3184.1950 3189.9401 3504.6444 3584.7448
redmass: 6.4543 6.3766 6.2191 9.5018 7.4369 3.8589 7.6322 13.6615 7.3415 9.1040 3.7845 8.6375 4.9692 11.6368 3.8397 11.5212 7.0097 4.2246 2.7114 5.8064 5.1544 3.9859 1.4738 2.7103 6.3321 6.2427 5.9283 8.0021 4.0487 7.1919 3.9385 5.9997 5.2719 8.1683 4.5111 4.0782 5.2282 6.9930 2.6555 3.6562 8.4052 3.5664 4.8847 6.6386 5.9705 2.1377 7.3993 5.8743 8.0232 4.0073 1.4530 10.0364 8.4974 7.1750 4.9096 5.0451 3.1417 1.8077 3.2589 4.5518 3.5863 4.8424 1.6291 5.5557 2.6737 1.5439 5.2446 2.7142 1.3684 1.4921 2.6359 1.3738 1.3657 2.9946 1.4444 2.5491 3.1131 3.1216 2.1877 1.8473 2.2209 4.1142 1.8704 5.8240 2.2373 1.7663 1.3826 1.5983 1.2233 1.2268 3.5084 5.1742 1.2159 7.8643 1.1257 1.2218 1.6728 1.1284 2.8210 4.3241 1.9238 1.2802 4.4870 1.9205 2.5343 11.5676 9.1207 1.3671 2.1489 5.1945 5.4024 1.9970 3.2087 2.1821 1.0985 1.0812 1.6609 1.4233 1.1047 3.2581 4.5004 9.0786 3.7448 7.8226 6.9342 6.0328 1.0578 1.0583 1.0585 1.0647 1.1055 1.1009 1.1036 1.0997 1.0866 1.0899 1.0871 1.0949 1.0961 1.0985 1.0929 1.0930 1.0756 1.0667
irintensity: 0.0657 0.7146 0.3064 0.1552 0.9385 1.5136 0.5548 0.6223 5.6946 0.5047 5.8490 2.3281 0.8897 1.9051 1.5631 3.8326 4.2225 5.3883 53.4419 2.5266 20.8715 28.0682 134.6495 7.3839 0.2058 2.2690 3.0246 11.8315 3.2452 1.7064 2.1298 12.0122 5.1829 0.6780 12.2552 9.4879 5.5479 15.7326 23.2006 5.6043 1.4704 5.8618 2.4592 6.6369 13.8920 38.9518 6.3801 16.8613 5.2157 2.6012 98.1300 46.0373 10.8461 9.0180 10.3009 26.9335 33.7661 76.7673 16.5715 48.3584 4.3380 9.5512 31.9232 6.9877 36.2071 1.0344 57.7501 3.1927 4.5234 31.2839 21.8193 1.1716 0.4727 48.6203 5.1491 5.4874 102.2114 24.1232 5.8281 13.3977 63.8129 289.5592 6.9141 9.0663 14.9515 21.0363 459.1043 128.5524 294.2309 45.3670 679.2613 1030.7519 2.4779 268.2312 24.6433 70.2918 0.7578 18.5331 314.4356 910.8351 123.9520 60.8327 59.0802 40.0290 50.7917 127.3173 193.4811 1.9972 45.8756 12.0791 16.3348 15.4755 11.9212 9.0764 18.5714 12.6466 49.6499 39.4650 4.4343 83.5348 58.0046 138.5917 319.3134 400.1132 633.4130 14.6784 5.5149 70.3497 115.7279 32.9685 65.7154 112.7837 53.5372 23.1058 6.9004 12.3643 7.1511 20.6183 20.2590 15.7653 10.8860 9.5466 471.6388 6.9365
temp: 298.150 k
press: 1.00000 atm
elementType: 35 8 8 8 8 8 8 7 7 7 7 7 6 6 6 6 6 6 6 6 6 6 6 6 6 6 6 6 6 6 6 6 1 1 1 1 1 1 1 1 1 1 1 1 1 1 1 1 1 1
symmnumber: 1
zpe: 946255.9 jmol-1
zpe.correction: 0.360410 hartree
zpe.thermalcorrener: 0.390659 hartree
zpe.thermalcorrenthalpy: 0.391603 hartree
zpe.thermalcorrgfe: 0.292782 hartree
zpe.sumelectzpe: -1508.955924 hartree
zpe.sumelectthermal: -1508.925676 hartree
zpe.sumelectthermalent: -1508.924732 hartree
zpe.sumelectthermalfe: -1509.023552 hartree
dipole: -16.8713 -3.0164 -2.2781
dipole: 17.2896
quadrupole: -180.8883 -185.3865 -198.4970
quadrupole: -16.0607 9.8120 -2.4362
quadrupole: 7.3689 2.8708 -10.2397 -16.0607 9.8120 -2.4362
hfenergy: -1509.3163343 hartree
pointgroup: C01 [X(C20H18Br1N5O6)]
dipole: 6.7158253 0.3299607 1.0293129 debye
polarizability: 851.6727124|3.0447953|189.2916481|-7.5362559|-73.9060631|316.2042419 unknown
InChI: InChI=1S/C20H18BrN5O6/c21-16-11-13(25(28)29)12-19(26(30)31)20(16)24-23-18-6-5-17(22-7-9-32-10-8-27)14-3-1-2-4-15(14)18/h1-6,11-12,22,27H,7-10H2
charge 0 multiplicity 1
50 atoms
Br -3.756874 -0.79939 3.584631
O  7.029102 -0.556337 0.58473
O  9.256565 -1.745451 -1.056581
O  -2.966861 1.126782 -2.473289
O  -2.351059 -1.041772 -2.08611
O  -7.958088 0.406713 -1.268023
O  -8.405814 -0.048357 0.927928
N  4.371137 -0.283389 0.846951
N  -1.199994 0.25164 0.206886
N  -2.005043 -0.360679 1.066444
N  -2.971185 0.043447 -1.770789
N  -7.588758 0.120971 -0.061117
C  2.474573 0.682287 -0.37454
C  3.014393 -0.164347 0.689713
C  1.045137 0.799704 -0.522677
C  5.059496 -1.119752 1.838091
C  0.165225 0.085438 0.394384
C  2.114891 -0.857016 1.5576
C  3.321709 1.39739 -1.279677
C  0.731253 -0.732825 1.411491
C  0.516915 1.607661 -1.576894
C  6.513583 -0.643038 1.955066
C  2.782812 2.18736 -2.300835
C  1.369543 2.288854 -2.451655
C  8.433925 -0.12574 0.519738
C  -3.358129 -0.264351 0.731078
C  -3.870073 -0.000184 -0.588528
C  8.933289 -0.322736 -0.903596
C  -4.34152 -0.444149 1.758359
C  -5.233993 0.153143 -0.857901
C  -6.145925 -0.018098 0.203358
C  -5.714335 -0.328112 1.514482
H  5.007875 0.093285 0.138584
H  4.573403 -1.03504 2.827053
H  5.037545 -2.185374 1.531899
H  2.510594 -1.509638 2.340284
H  4.412911 1.346978 -1.189313
H  0.048115 -1.26561 2.080275
H  -0.568564 1.67471 -1.689584
H  6.562235 0.353765 2.445827
H  7.103781 -1.368295 2.55192
H  3.446534 2.726629 -2.984837
H  0.948574 2.899408 -3.257081
H  9.054349 -0.736405 1.207419
H  8.511227 0.943137 0.815977
H  9.836175 0.306492 -1.058244
H  8.144748 0.004795 -1.613209
H  -5.598304 0.378825 -1.863379
H  -6.455147 -0.453472 2.307214
H  9.370552 -1.967262 -2.013824
