program: Gaussian 09
title: 000103069
version: EM64L-G09RevD.01
frameworkgroup: C1[X(C13H12N4O4S)]
method: RPBEPBE
basis: SDD
operation: Freq
keyword: #p
keyword: freq=noraman
keyword: PBEPBE/SDD
title: #p freq=noraman PBEPBE/SDD
converged: YES YES NO NO
title: Mulliken charges:
elementType: S O O O O N N N N C C C C C C C C C C C C C H H H H H H H H H H H H
charge: 0.950143 -0.597581 -0.240098 -0.503572 -0.488229 -0.527601 -0.456862 -0.435037 -0.703410 0.294667 0.550679 0.237133 0.546417 -0.524620 -0.316652 -0.467941 -0.305650 -0.319205 -0.484479 0.101362 0.565059 -0.437792 0.272985 0.361021 0.237690 0.234073 0.330220 0.328010 0.274702 0.287986 0.226712 0.313441 0.317960 0.378471
chargesum: 0.00000
title: Mulliken charges with hydrogens summed into heavy atoms:
elementType: S O O O O N N N N C C C C C C C C C C C C C
charge: 0.950143 -0.219111 -0.240098 -0.503572 -0.488229 -0.166580 -0.126642 -0.107027 -0.072010 0.294667 0.550679 0.237133 0.546417 -0.251634 -0.316652 -0.230252 -0.071576 -0.044503 -0.196493 0.101362 0.565059 -0.211080
polarizability: 3.97356586e+02 8.07110529e+00 2.29816844e+02 4.64356549e+00 1.46461730e+01 1.28893476e+02
1716.lowfreq: -6.7550 -2.9945 0.0012 0.0014 0.0016 1.7694 24.6280 34.5590 44.4981
frequency: 24.6035 34.5516 44.4976 58.6625 94.5000 123.0091 130.6673 138.6226 174.6175 179.3297 221.1184 228.0341 241.0361 261.9779 279.7966 298.8889 309.8179 330.4397 331.2712 347.2414 352.9416 379.0937 388.2755 408.4578 426.4815 437.2160 448.5613 486.3983 500.0918 523.1741 526.3760 569.6253 571.6616 578.0306 595.3501 632.9243 664.5481 685.1105 688.0432 706.9986 709.0603 741.4958 786.3371 807.3914 816.9686 821.8116 836.0790 850.1030 863.3777 865.8314 875.5131 921.0141 949.9374 957.2579 962.1885 969.7313 993.8180 1005.6644 1038.5499 1121.6987 1146.9031 1170.9249 1187.6650 1233.4433 1241.6482 1263.2854 1285.0675 1307.3372 1323.7545 1325.8523 1356.8170 1371.2903 1407.1304 1442.6396 1491.7434 1502.9500 1506.8978 1527.5677 1577.0357 1619.4191 1639.9720 1651.6758 1654.2426 1699.4461 3129.4526 3138.0186 3147.4104 3160.8998 3163.2631 3167.4561 3372.8138 3501.9130 3570.7294 3623.0895 3625.2980 3710.1647
redmass: 10.0937 4.9339 6.7383 7.4131 8.0835 5.2999 7.2553 7.3974 4.4625 5.7773 6.2367 5.7825 5.3446 5.7880 5.3266 4.9682 3.0054 1.4510 1.9094 3.0730 6.8743 1.2476 6.6340 5.6964 3.0400 4.6932 4.5422 7.2921 6.5515 4.6925 1.2179 1.0502 4.6894 4.9698 4.0781 4.3378 6.4564 1.4303 5.8344 10.5555 2.7583 3.9998 2.9882 1.8612 2.6523 2.2544 7.9293 3.8477 2.3019 1.5989 2.6402 1.3611 4.1526 1.3945 7.8387 2.9110 2.0623 1.3973 1.5277 2.0578 1.3890 2.0222 1.8090 1.4460 1.4644 1.8730 3.9773 1.9539 2.2248 2.1185 2.3204 5.8109 3.3246 4.5632 5.7651 3.4574 3.1384 3.5806 2.3589 5.1991 1.4223 7.3134 3.2672 7.8917 1.0893 1.0883 1.0916 1.0943 1.0959 1.0937 1.0785 1.0664 1.0452 1.0800 1.0818 1.1042
irintensity: 1.4126 2.3130 0.4902 1.2584 0.8068 2.4197 3.2121 1.5709 24.2955 5.3573 3.8342 1.1700 7.5417 1.6812 1.1869 7.1977 18.9949 63.8733 46.9878 10.1830 6.4577 262.3750 14.9357 18.8849 10.7929 7.3264 54.2140 33.2054 115.8323 26.1493 7.0116 236.3598 10.9454 5.8361 27.8087 19.2423 10.2260 122.5686 8.9872 22.8601 13.9643 0.3646 20.1259 50.9568 22.2995 59.5632 75.7214 5.0100 8.7430 42.0497 22.9946 0.1681 12.5091 4.4916 89.3943 39.1957 27.1206 105.8540 15.0885 1.4926 17.7731 24.7131 29.3209 14.6378 28.6406 15.6914 23.9422 108.0763 75.6570 55.8892 40.0981 62.3003 42.2348 16.0162 43.0132 108.8191 736.2750 192.1388 130.9449 102.4700 124.9419 47.9497 129.4170 968.9990 19.1275 10.8040 9.7728 11.5789 5.3028 2.5572 88.9063 45.4994 127.3595 89.4173 63.2280 24.6709
temp: 298.150 k
press: 1.00000 atm
elementType: 16 8 8 8 8 7 7 7 7 6 6 6 6 6 6 6 6 6 6 6 6 6 1 1 1 1 1 1 1 1 1 1 1 1
symmnumber: 1
zpe: 637376.9 jmol-1
zpe.correction: 0.242764 hartree
zpe.thermalcorrener: 0.263109 hartree
zpe.thermalcorrenthalpy: 0.264053 hartree
zpe.thermalcorrgfe: 0.193482 hartree
zpe.sumelectzpe: -1418.848287 hartree
zpe.sumelectthermal: -1418.827942 hartree
zpe.sumelectthermalent: -1418.826998 hartree
zpe.sumelectthermalfe: -1418.897568 hartree
dipole: 2.5420 3.1024 -3.4995
dipole: 5.3229
quadrupole: -158.7351 -107.9403 -143.4392
quadrupole: 33.8516 7.6308 9.2808
quadrupole: -22.0302 28.7646 -6.7343 33.8516 7.6308 9.2808
hfenergy: -1419.0910506 hartree
pointgroup: C01 [X(C13H12N4O4S1)]
dipole: -1.063081 -1.193051 -1.3535723 debye
polarizability: 397.3736479|2.8164292|229.4343495|-10.4784792|-14.7433722|129.2589088 unknown
InChI: InChI=1S/C13H12N4O4S/c14-7-1-3-10(12(5-7)22(19,20)21)15-8-2-4-9-11(6-8)17-13(18)16-9/h1-6,15-17,19H,14H2
charge 0 multiplicity 1
34 atoms
S  -3.318488 1.716309 0.703384
O  -2.73897 2.64981 -0.863058
O  6.207108 -1.267948 0.983426
O  -4.925423 1.82838 0.853352
O  -2.383666 2.263331 1.903782
N  -0.612124 0.766653 -0.57342
N  3.807993 -1.142517 0.8705
N  4.981767 0.355143 -0.299556
N  -4.602803 -3.273478 -0.050254
C  2.869961 -0.321167 0.220307
C  0.798658 0.66479 -0.548819
C  3.620377 0.640411 -0.526131
C  -1.540981 -0.259213 -0.353677
C  1.46799 -0.322584 0.231741
C  -2.859546 0.006091 0.104804
C  1.550111 1.621502 -1.292544
C  2.9634 1.625952 -1.279364
C  -1.295602 -1.629604 -0.676059
C  -3.896702 -0.939209 0.192194
C  5.138558 -0.749575 0.570238
C  -3.618743 -2.289488 -0.140092
C  -2.291438 -2.609017 -0.5639
H  0.903012 -1.02331 0.852277
H  -1.019538 1.682804 -0.812947
H  1.014998 2.366598 -1.891293
H  3.518613 2.375253 -1.852141
H  3.612114 -1.91981 1.496651
H  5.783337 0.851356 -0.681002
H  -0.312652 -1.903435 -1.069837
H  -4.890584 -0.62405 0.52771
H  -2.051729 -3.642956 -0.839877
H  -4.393616 -4.239936 -0.280724
H  -5.549087 -3.042934 0.237223
H  -2.888405 3.623748 -0.695896
