program: Gaussian 09
title: 000103167
version: EM64L-G09RevD.01
frameworkgroup: C1[X(C16H18S2)]
method: RPBEPBE
basis: SDD
operation: Freq
keyword: #pfreq=noraman
keyword: PBEPBE/SDD
title: #p freq=noraman PBEPBE/SDD
converged: YES YES NO NO
title: Mulliken charges:
elementType: S S C C C C C C C C C C C C C C C C H H H H H H H H H H H H H H H H H H
charge: 0.054144 0.026572 0.340609 0.367381 -0.583658 -0.403737 0.554710 0.532925 -0.426144 -0.204225 -0.793427 -0.434578 -0.438913 -0.807022 -0.227424 -0.213155 -0.811861 -0.808825 0.234109 0.261358 0.236594 0.236810 0.241638 0.221055 0.253354 0.228307 0.229034 0.230144 0.232213 0.227736 0.251026 0.252244 0.218635 0.242238 0.264090 0.216044
chargesum: 0.00000
title: Mulliken charges with hydrogens summed into heavy atoms:
elementType: S S C C C C C C C C C C C C C C C C
charge: 0.054144 0.026572 0.340609 0.367381 -0.583658 -0.403737 0.554710 0.532925 -0.192035 0.057133 -0.077380 -0.197984 -0.202104 -0.119537 0.004789 0.014581 -0.089956 -0.086453
polarizability: 2.62173510e+02 -8.43395219e+00 2.15337143e+02 2.43809846e+01 -3.29701591e+00 1.66672420e+02
1716.lowfreq: -24.9507 -9.8520 -5.8344 -0.0027 0.0006 0.0009 14.8689 25.9838 30.6705
frequency: -8.1575 24.1390 30.0641 41.8773 73.1580 74.8399 108.7786 120.7006 142.6031 144.4677 160.9393 218.1946 219.1204 243.1922 251.7004 258.4084 279.7300 297.5066 328.6340 367.9724 377.8175 397.4044 447.0257 449.8850 505.2319 507.6191 513.6754 521.9659 524.1675 535.6800 570.1615 602.4800 717.4955 732.2432 754.5163 782.4018 786.4149 788.4654 822.5223 898.4127 908.2226 913.3249 978.7410 981.4534 985.5077 988.4235 999.6255 1016.6870 1027.0598 1034.6901 1045.9387 1047.2549 1053.9679 1080.6651 1109.7797 1138.9377 1176.7034 1180.8669 1207.0969 1250.8659 1256.1843 1262.3988 1355.9319 1359.0133 1392.0536 1397.9119 1400.1342 1402.1503 1405.2368 1411.5027 1441.5582 1444.0743 1454.7705 1460.5360 1461.2447 1464.3765 1474.7872 1476.4236 1478.6807 1479.7278 1569.3314 1580.8676 1586.6250 1593.7521 2972.6750 2975.6344 2979.6588 2986.7141 3044.5080 3048.9643 3060.1076 3070.2080 3085.3023 3089.6186 3091.6754 3107.7173 3120.5917 3122.7869 3132.0744 3145.2538 3154.6188 3167.1714
redmass: 3.3187 4.0775 3.7651 1.7463 5.1606 2.1334 2.5242 1.0961 2.6602 1.2285 1.1183 3.1038 2.7698 5.5314 5.7721 3.4549 3.7185 3.4226 2.6976 12.0727 8.6302 6.6111 3.0137 2.9579 3.9120 3.5971 3.8182 4.3195 3.5826 3.9727 4.9312 5.5120 2.5327 3.6200 6.0149 1.2083 2.8770 1.7518 3.9022 1.3063 2.8137 1.3387 1.3468 1.3472 1.4807 1.4331 1.8676 7.2284 1.4354 1.7048 1.5801 1.5478 1.6367 2.0459 1.6439 2.0483 1.1608 1.6494 2.0556 1.6437 1.8806 3.6983 7.6556 6.7910 1.2457 1.4762 1.4491 1.5449 1.2395 2.0219 2.8769 1.8356 1.0792 1.0644 1.0632 1.1825 1.1499 1.0755 1.1918 1.0783 6.1557 7.2783 5.1589 6.0050 1.0375 1.0396 1.0377 1.0368 1.0967 1.0967 1.0953 1.0969 1.0986 1.1001 1.1002 1.0963 1.0856 1.0877 1.0919 1.0912 1.0996 1.0988
irintensity: 0.1246 0.0326 0.1573 0.2617 0.3745 0.0377 0.7398 0.6390 0.8703 0.9988 2.2894 1.6344 0.0713 2.4910 1.5383 2.5382 8.4015 5.3514 0.7963 0.0479 2.7463 8.0727 1.0242 1.0342 1.5765 3.0969 1.2981 0.8693 0.6488 2.0488 0.0655 0.5808 14.7128 3.5736 0.0684 52.6722 11.9233 30.3135 0.6394 0.1107 1.1067 0.1938 0.0277 0.1947 1.6961 7.8948 3.6550 0.6863 10.7504 0.3107 13.8240 5.4107 1.3040 8.7732 3.9754 3.9967 2.7842 0.4502 12.3951 0.5212 0.5418 3.3905 4.1975 0.6343 3.9668 14.2283 27.5811 11.7314 20.2255 2.5415 15.1184 3.7766 14.4369 3.9175 8.7813 14.0836 13.1690 26.5721 30.1512 19.9042 0.4548 13.4220 5.5692 3.2783 41.3726 8.4322 22.5285 19.4633 35.4224 0.7509 13.4090 9.7090 21.9008 17.9489 21.6447 5.1692 0.6429 11.2244 24.4373 17.5852 38.3706 19.9207
temp: 298.150 k
press: 1.00000 atm
elementType: 16 16 6 6 6 6 6 6 6 6 6 6 6 6 6 6 6 6 1 1 1 1 1 1 1 1 1 1 1 1 1 1 1 1 1 1
symmnumber: 1
zpe: 757905.9 jmol-1
zpe.correction: 0.288671 hartree
zpe.thermalcorrener: 0.307395 hartree
zpe.thermalcorrenthalpy: 0.308339 hartree
zpe.thermalcorrgfe: 0.240598 hartree
zpe.sumelectzpe: -1415.330767 hartree
zpe.sumelectthermal: -1415.312043 hartree
zpe.sumelectthermalent: -1415.311099 hartree
zpe.sumelectthermalfe: -1415.378840 hartree
dipole: 0.7959 3.3127 -0.2523
dipole: 3.4163
quadrupole: -113.2602 -119.2895 -119.4293
quadrupole: 0.3689 6.8781 -1.2598
quadrupole: 4.0661 -1.9632 -2.1030 0.3689 6.8781 -1.2598
hfenergy: -1415.619438 hartree
pointgroup: C01 [X(C16H18S2)]
dipole: -0.3531735 -1.2859968 -0.1674723 debye
polarizability: 261.3422346|-8.4564744|215.3042356|-25.2974715|6.7253199|167.5366026 unknown
InChI: InChI=1S/C16H18S2/c1-11-7-6-10-15(14(11)4)17-18-16-12(2)8-5-9-13(16)3/h5-10H,1-4H3
charge 0 multiplicity 1
36 atoms
S  1.237128 1.965625 1.062267
S  -0.288661 2.419529 -0.657525
C  -1.826264 0.014608 -0.838567
C  -2.96183 -0.780411 -0.475886
C  1.95831 0.357375 0.544811
C  -1.684858 1.299623 -0.231766
C  2.897923 0.315534 -0.531713
C  1.592534 -0.819658 1.269624
C  -3.900954 -0.28261 0.459244
C  -2.637964 1.786046 0.7003
C  -0.825896 -0.533868 -1.837453
C  3.466788 -0.935668 -0.875978
C  2.193788 -2.047205 0.892984
C  -3.16248 -2.156445 -1.086347
C  -3.748439 0.994252 1.047128
C  3.119632 -2.108347 -0.170891
C  3.273507 1.559368 -1.311117
C  0.600123 -0.791292 2.418465
H  -4.763785 -0.903876 0.72812
H  -2.492885 2.776958 1.141084
H  4.187991 -0.984083 -1.700039
H  1.930361 -2.958567 1.44234
H  -0.30844 -1.424784 -1.43212
H  -1.327898 -0.84945 -2.771614
H  -0.059308 0.214362 -2.088555
H  -4.059498 -2.647085 -0.67217
H  -2.294785 -2.816725 -0.897636
H  -3.283959 -2.101111 -2.185276
H  -4.487355 1.365139 1.765454
H  3.571622 -3.067567 -0.4480
H  3.596333 2.371934 -0.636094
H  2.404804 1.95134 -1.87328
H  4.084166 1.346386 -2.028328
H  0.986475 -0.207337 3.273824
H  -0.349388 -0.314758 2.118425
H  0.386061 -1.814633 2.771986
