program: Gaussian 09
title: 000008973
version: EM64L-G09RevD.01
frameworkgroup: C1[X(C7H14O6)]
method: RPBEPBE
basis: SDD
operation: Freq
keyword: #pfreq=noraman
keyword: PBEPBE/SDD
title: #p freq=noraman PBEPBE/SDD
converged: YES YES NO NO
title: Mulliken charges:
elementType: O O O O O O C C C C C C C H H H H H H H H H H H H H H
charge: -0.327784 -0.424571 -0.481108 -0.457991 -0.448585 -0.221083 -0.125848 -0.078523 -0.074657 -0.140498 -0.403886 -0.075676 -0.523965 0.262519 0.289026 0.190908 0.230269 0.238500 0.235350 0.351602 0.204762 0.369902 0.363601 0.219214 0.250090 0.230715 0.347718
chargesum: 0.00000
title: Mulliken charges with hydrogens summed into heavy atoms:
elementType: O O O O O O C C C C C C C
charge: -0.327784 -0.072969 -0.111206 -0.094390 -0.100867 -0.221083 0.136670 0.210503 0.116250 0.089772 0.069964 0.129085 0.176054
polarizability: 1.10019649e+02 -6.92238797e+00 9.84027010e+01 -9.28921174e-01 -1.56332350e+00 8.51231765e+01
1716.lowfreq: -12.0632 -3.9847 0.0003 0.0006 0.0010 10.0569 49.2446 55.7382 71.6618
frequency: 49.1878 55.6370 71.6506 72.2375 89.7356 117.0659 152.0619 156.3600 168.1712 217.0435 244.7090 258.9460 281.2835 304.7799 306.9472 333.1097 387.5649 414.1408 460.6121 505.4744 526.0667 549.5915 571.6585 613.7263 697.3787 709.8358 803.2264 833.2368 864.1454 911.1278 951.1187 964.0614 1001.8551 1021.0782 1031.7980 1061.7943 1068.3831 1082.6524 1098.3796 1118.7917 1131.0361 1156.8197 1194.8802 1215.8350 1257.5277 1263.3445 1283.9458 1303.9327 1318.8554 1324.8722 1329.6374 1343.3718 1363.4668 1364.3325 1382.2487 1402.0752 1439.2676 1453.8575 1456.7617 1484.7815 1603.2283 2916.8267 2929.8839 2959.1031 2993.9583 3013.6213 3050.7039 3057.8776 3068.3153 3095.7509 3110.0561 3386.5134 3466.1904 3481.4596 3568.3265
redmass: 6.8696 5.3176 3.9042 3.4258 4.9105 3.6625 3.0723 1.5488 3.4753 4.7764 4.7938 4.1019 5.5122 4.9326 1.1502 4.1002 3.6672 3.7858 3.8999 2.3850 1.2999 1.0898 1.2046 2.9160 4.8661 3.0146 4.2587 2.8145 2.5900 4.8490 3.3472 2.6678 3.5006 1.7293 5.0166 2.7401 3.0813 3.0017 2.1946 1.2425 1.2662 1.4057 1.4331 1.3174 1.2323 1.3226 1.1880 1.2408 1.2176 1.2814 1.3079 1.2938 1.2852 1.1722 1.4548 1.7140 1.1378 1.0801 1.0510 1.0533 8.1350 1.0830 1.0809 1.0317 1.0900 1.0600 1.1035 1.0859 1.0864 1.1057 1.1019 1.0642 1.0647 1.0650 1.0664
irintensity: 0.1999 2.9557 1.8036 3.8138 7.5551 11.8274 1.5907 0.4528 2.2782 4.3813 7.2234 20.3816 12.4807 35.0170 96.0226 1.1823 3.4654 11.2547 8.4054 77.4630 73.6753 185.2383 167.5093 10.6141 4.9902 33.3958 12.5874 31.3972 26.3805 57.6336 34.3373 30.6523 74.9542 26.4346 47.6976 36.1284 110.1498 18.1037 44.2954 1.0273 36.7855 4.8828 7.5994 22.1468 10.1762 9.7513 72.9623 27.4295 45.2394 5.3618 2.9755 20.2051 35.4281 12.2728 43.4464 7.6562 4.8686 6.3024 6.5307 10.5193 145.6616 54.9729 28.5488 61.8264 53.0072 24.1076 35.7565 3.2169 9.9176 19.9852 22.5290 41.6152 14.1371 28.9968 9.5480
temp: 298.150 k
press: 1.00000 atm
elementType: 8 8 8 8 8 8 6 6 6 6 6 6 6 1 1 1 1 1 1 1 1 1 1 1 1 1 1
symmnumber: 1
zpe: 564035.0 jmol-1
zpe.correction: 0.214830 hartree
zpe.thermalcorrener: 0.230240 hartree
zpe.thermalcorrenthalpy: 0.231184 hartree
zpe.thermalcorrgfe: 0.172000 hartree
zpe.sumelectzpe: -725.350111 hartree
zpe.sumelectthermal: -725.334700 hartree
zpe.sumelectthermalent: -725.333756 hartree
zpe.sumelectthermalfe: -725.392941 hartree
dipole: -2.8325 3.8269 -2.3276
dipole: 5.2996
quadrupole: -80.9634 -75.8527 -80.5659
quadrupole: 5.0724 7.1835 -3.3795
quadrupole: -1.8360 3.2746 -1.4386 5.0724 7.1835 -3.3795
hfenergy: -725.5649403 hartree
pointgroup: C01 [X(C7H14O6)]
dipole: -0.8689265 1.5482814 -1.0932015 debye
polarizability: 107.2894693|-8.6602255|100.5180631|-0.7362817|-3.0679377|85.7379944 unknown
InChI: InChI=1S/C7H14O6/c1-13-7(5(11)3-9)6(12)4(10)2-8/h3-8,10-12H,2H2,1H3
charge 0 multiplicity 1
27 atoms
O  1.039048 1.411798 -0.899687
O  0.032979 -1.124975 -1.221476
O  -1.77915 1.191605 1.062702
O  2.145209 -0.854009 1.83374
O  -4.077434 -0.126918 0.148068
O  3.12758 -2.162326 -0.294395
C  -0.249016 -0.427464 0.048112
C  0.869829 0.589988 0.319584
C  -1.646326 0.224519 -0.035876
C  2.230755 -0.09825 0.599724
C  -2.771328 -0.819273 0.066304
C  2.72151 -0.995847 -0.539413
C  0.683614 2.828928 -0.714809
H  -0.225197 -1.203729 0.831754
H  0.600333 1.211666 1.191353
H  -1.728678 0.760722 -1.010565
H  2.984357 0.716842 0.699079
H  -2.693477 -1.366288 1.020802
H  -2.727158 -1.534661 -0.776206
H  0.243919 -0.404451 -1.878269
H  2.783354 -0.540328 -1.549548
H  -2.756748 1.302551 1.218908
H  2.531166 -1.75739 1.637201
H  1.389278 3.321217 -0.016802
H  -0.3459 2.931954 -0.323212
H  0.767874 3.294165 -1.709833
H  -4.359693 0.156354 -0.758139
