program: Gaussian 09
title: 000103050
version: EM64L-G09RevD.01
frameworkgroup: C1[X(C22H29ClO2)]
method: RPBEPBE
basis: SDD
operation: Freq
keyword: #p
keyword: freq=noraman
keyword: PBEPBE/SDD
title: #p freq=noraman PBEPBE/SDD
converged: YES YES NO NO
title: Mulliken charges:
elementType: Cl O O C C C C C C C C C C C C C C C C C C C C C C H H H H H H H H H H H H H H H H H H H H H H H H H H H H H
charge: 0.024827 -0.172929 -0.164464 -0.385148 -0.387164 -0.393348 -0.383619 -0.373120 -0.383163 -0.385239 -0.371842 -0.559742 -0.354046 0.573144 -0.356289 -0.183551 -0.586842 0.271431 -0.696861 0.265617 0.055173 -0.374927 -0.358314 -0.225948 -0.225627 0.194562 0.195315 0.193868 0.195038 0.198043 0.198174 0.192369 0.193815 0.202078 0.199133 0.191600 0.192822 0.219785 0.226291 0.188625 0.189874 0.253699 0.239237 0.188066 0.187358 0.194953 0.194465 0.209743 0.209561 0.214900 0.290476 0.291023 0.243300 0.243820
chargesum: 0.00000
title: Mulliken charges with hydrogens summed into heavy atoms:
elementType: Cl O O C C C C C C C C C C C C C C C C C C C C C C
charge: 0.024827 -0.172929 -0.164464 0.004728 0.001742 0.002870 0.002565 0.028090 0.001259 0.060837 0.006656 -0.066806 0.021379 0.573144 0.033129 -0.183551 -0.586842 0.271431 -0.062657 0.265617 0.055173 -0.084452 -0.067291 0.017352 0.018193
polarizability: 3.51710240e+02 -1.73369496e+01 2.66799160e+02 -4.09015713e+01 -1.54354418e+01 1.81659417e+02
1716.lowfreq: -4.7883 -0.0012 0.0016 0.0019 4.2277 6.6935 12.1156 17.2267 24.1823
frequency: 12.0618 17.1977 24.0444 37.4842 46.4781 51.7713 58.2637 69.3889 75.1369 89.4943 93.0617 100.9328 124.0558 126.0295 130.4349 144.8569 150.0036 152.3409 164.8343 199.2571 210.9100 226.2497 254.0125 268.8418 285.0791 299.3893 326.3483 350.5166 375.9979 377.6398 397.1531 422.0542 438.1431 453.6040 479.9662 482.6520 499.3614 553.9332 595.5354 656.0419 668.7845 698.5814 720.2733 722.4294 726.5921 727.0210 734.6498 750.9919 773.1616 798.0895 805.5603 821.3615 844.2569 848.3439 888.0396 888.8797 929.9180 938.1070 952.3902 977.1342 983.8208 987.6310 996.2924 1011.3527 1014.5309 1018.1506 1026.5006 1031.3644 1047.3917 1064.1847 1070.3768 1074.4606 1079.2819 1081.4702 1084.2018 1099.1980 1120.1516 1122.6364 1173.1129 1179.6804 1186.2680 1200.7101 1204.7975 1227.7854 1230.6814 1244.5234 1255.9519 1258.7607 1273.5898 1275.8777 1277.6104 1281.6127 1283.6067 1287.5477 1290.8017 1293.8504 1296.4479 1303.1152 1312.1841 1321.2236 1336.6613 1348.5209 1352.0489 1355.1867 1355.7727 1389.7724 1401.4836 1439.3915 1450.7123 1459.6664 1459.9767 1462.6714 1463.4014 1465.2300 1468.5563 1471.4256 1473.4883 1476.4416 1478.5637 1483.3554 1487.3757 1489.6764 1537.8989 1554.2558 1578.8220 1603.6185 1607.0496 2948.8140 2949.1077 2950.7846 2951.5890 2953.9028 2956.4927 2960.8106 2965.1012 2968.4204 2971.4637 2981.6288 2982.4389 2984.9332 2989.7208 2996.1170 3003.7712 3010.6248 3013.8396 3024.0346 3033.3854 3041.0517 3048.2633 3067.7310 3069.8750 3080.8457 3140.1055 3154.3710 3164.8690 3174.4418
redmass: 5.5847 4.9375 4.9814 5.0298 1.6418 3.3463 8.9768 1.6270 4.8873 2.9531 4.9840 1.6074 4.6086 2.5509 1.7365 4.2927 2.0409 1.9779 5.7811 4.5633 7.4783 1.1342 3.8991 4.7040 4.8053 6.5475 3.9633 4.8932 8.9546 4.0581 3.9515 3.6600 3.9044 6.0566 5.2330 3.4238 3.7597 5.4667 6.2145 5.9073 4.5862 4.6901 1.0590 1.0668 1.1493 2.4342 1.1653 1.3124 1.7317 1.7495 1.7513 2.7032 1.6152 3.5145 1.9035 1.3352 1.6923 1.3223 5.2273 5.0068 4.0838 1.3047 1.4008 4.0967 1.3787 3.7109 1.1486 2.1938 3.2994 3.0056 2.6960 2.6636 2.3051 2.1507 2.3125 1.9481 2.2848 2.6434 1.0978 2.0534 2.0477 1.2640 1.6078 1.4938 1.3118 1.7686 1.3329 1.4086 1.2976 2.6579 1.0307 1.2941 1.0794 1.2800 1.0832 1.1732 1.1141 1.3686 1.9500 1.3379 1.4172 1.5206 1.7000 1.6424 1.6324 1.2177 10.1605 2.3056 1.1702 1.0742 1.0750 1.0713 1.0704 1.0701 1.0847 2.6106 1.0850 1.0441 1.0850 1.0907 1.0942 1.0961 9.5268 10.4505 8.8706 8.6891 6.7946 1.0586 1.0585 1.0590 1.0591 1.0591 1.0593 1.0591 1.0586 1.0583 1.0370 1.0960 1.0587 1.0970 1.0985 1.1003 1.1022 1.0583 1.1035 1.1045 1.1047 1.1045 1.1043 1.1006 1.0992 1.1045 1.0864 1.0903 1.0948 1.1005
irintensity: 0.1817 0.0937 0.1854 0.8033 0.0377 0.1883 3.5145 0.0175 0.8986 0.1069 0.3529 0.0055 0.0047 0.0372 0.0088 0.6867 0.0157 0.0072 0.9848 0.1635 0.3005 0.0010 0.0981 0.2374 0.3306 1.8297 0.0385 0.7531 13.8414 0.9250 2.5414 1.6292 1.7306 5.1739 1.6400 0.2648 0.0883 5.3735 14.0786 4.9521 0.1354 5.2107 17.1598 0.3085 11.0559 59.6436 0.8376 1.0363 24.3756 35.4391 31.8304 36.7093 0.6433 1.2247 4.9070 1.6045 0.1588 7.7557 6.3388 6.3420 7.4219 1.1155 3.2302 20.1276 0.0523 2.6756 3.4029 0.3631 1.0858 5.8398 14.7008 3.4589 0.0855 0.0697 0.2645 41.8704 3.2847 24.5845 8.5212 10.7122 15.9748 31.8040 2.9898 3.4538 1.4662 27.8793 4.7567 31.2753 28.2927 181.6494 3.3557 1.8468 4.4346 33.6404 0.2686 12.4152 1.9884 15.9874 73.3910 6.8657 1.6731 0.8560 0.6567 0.0822 0.4059 11.2815 0.0662 1.7889 13.1894 0.0513 0.1802 0.1327 0.2085 0.3285 1.2093 2.8210 1.7403 12.1179 2.0192 3.3590 3.0614 40.0297 38.4921 234.0451 111.7727 51.4803 3.3426 0.0177 0.0531 0.0810 0.9955 0.1824 3.2380 3.0294 104.7612 203.5341 35.5214 0.0851 34.7455 0.1476 0.1649 0.2110 0.2860 24.1258 0.2925 4.3631 0.8022 153.3608 136.3034 98.4085 56.2099 13.8676 3.5909 4.5510 1.0971 25.2396
temp: 298.150 k
press: 1.00000 atm
elementType: 17 8 8 6 6 6 6 6 6 6 6 6 6 6 6 6 6 6 6 6 6 6 6 6 6 1 1 1 1 1 1 1 1 1 1 1 1 1 1 1 1 1 1 1 1 1 1 1 1 1 1 1 1 1
symmnumber: 1
zpe: 1193857.7 jmol-1
zpe.correction: 0.454716 hartree
zpe.thermalcorrener: 0.481792 hartree
zpe.thermalcorrenthalpy: 0.482736 hartree
zpe.thermalcorrgfe: 0.392333 hartree
zpe.sumelectzpe: -1464.363915 hartree
zpe.sumelectthermal: -1464.336840 hartree
zpe.sumelectthermalent: -1464.335896 hartree
zpe.sumelectthermalfe: -1464.426299 hartree
dipole: 0.5769 -2.5766 -0.1096
dipole: 2.6427
quadrupole: -141.0857 -162.7016 -161.2503
quadrupole: -24.1148 -3.7997 6.3021
quadrupole: 13.9268 -7.6890 -6.2378 -24.1148 -3.7997 6.3021
hfenergy: -1464.8186316 hartree
pointgroup: C01 [X(C22H29Cl1O2)]
dipole: -0.2453475 -1.0079556 0.0694257 debye
polarizability: 352.7728666|14.6135027|267.0346645|-40.0364577|13.8961353|180.3612852 unknown
InChI: InChI=1S/C22H29ClO2/c1-2-3-4-5-6-7-8-9-10-11-16-19-20(23)22(25)18-15-13-12-14-17(18)21(19)24/h12-15H,2-11,16H2,1H3
charge 0 multiplicity 1
54 atoms
Cl -2.953505 3.221033 -0.153733
O  -3.030956 -1.830366 -1.302588
O  -5.587584 2.445146 1.005448
C  3.443678 0.333205 -0.738151
C  4.609747 0.017114 0.225397
C  2.051013 0.203424 -0.080739
C  5.99929 0.148516 -0.437887
C  0.891734 0.490544 -1.061522
C  7.169708 -0.1939 0.511266
C  -0.498761 0.36761 -0.401803
C  8.556184 -0.064748 -0.159218
C  -1.647505 0.631084 -1.424269
C  9.72995 -0.426124 0.778689
C  -3.005697 0.516423 -0.780752
C  11.114008 -0.301288 0.101382
C  -3.637301 -0.850438 -0.764584
C  -3.676617 1.558104 -0.184423
C  -4.968026 -1.023415 -0.10972
C  12.282263 -0.670878 1.040766
C  -5.631293 0.084029 0.486606
C  -5.012037 1.447155 0.479344
C  -5.574608 -2.302056 -0.086033
C  -6.894452 -0.094628 1.099122
C  -6.833347 -2.476238 0.526408
C  -7.494141 -1.371343 1.119114
H  3.499235 -0.347673 -1.613395
H  3.566121 1.361995 -1.137045
H  4.488738 -1.013265 0.620724
H  4.556089 0.694756 1.103193
H  1.935467 -0.819635 0.333812
H  1.985754 0.899067 0.781718
H  6.043778 -0.516166 -1.326287
H  6.126921 1.18352 -0.818888
H  0.954252 -0.212444 -1.9179
H  1.010512 1.510637 -1.48254
H  7.041947 -1.229309 0.891171
H  7.128661 0.469857 1.400361
H  -0.580632 1.086954 0.436403
H  -0.620395 -0.648045 0.021984
H  8.59026 -0.719205 -1.055701
H  8.688959 0.973773 -0.528899
H  -1.571522 -0.121422 -2.228835
H  -1.516546 1.638163 -1.858546
H  9.701132 0.229036 1.674737
H  9.59767 -1.464282 1.149612
H  11.246984 0.736852 -0.266178
H  11.13901 -0.953335 -0.79581
H  12.300409 -0.011902 1.929555
H  12.186943 -1.713221 1.399727
H  13.258986 -0.577154 0.53104
H  -5.044372 -3.138682 -0.551557
H  -7.382628 0.775254 1.549337
H  -7.300968 -3.466171 0.543902
H  -8.471506 -1.508414 1.593486
