program: Gaussian 09
title: 000103033
version: EM64L-G09RevD.01
frameworkgroup: C1[X(C6H10N2O2)]
method: RPBEPBE
basis: SDD
operation: Freq
keyword: #p
keyword: freq=noraman
keyword: PBEPBE/SDD
title: #p freq=noraman PBEPBE/SDD
converged: YES YES NO NO
title: Mulliken charges:
elementType: O O N N C C C C C C H H H H H H H H H H
charge: -0.211189 -0.232043 -0.406031 -0.400439 -0.149415 -0.034228 0.150868 -0.714181 -0.704698 0.188436 0.265770 0.237071 0.331524 0.203840 0.232471 0.218367 0.216714 0.218343 0.238172 0.350649
chargesum: 0.00000
title: Mulliken charges with hydrogens summed into heavy atoms:
elementType: O O N N C C C C C C
charge: -0.211189 -0.232043 -0.074507 -0.049790 0.116354 0.202843 0.150868 -0.059503 -0.031469 0.188436
polarizability: 9.58953671e+01 -6.23839027e+00 8.57419845e+01 7.73494226e+00 -4.12770516e-02 6.14010255e+01
1716.lowfreq: -15.7631 -13.7157 -12.0304 -0.0007 0.0002 0.0009 64.5517 83.4212 150.7246
frequency: 64.4839 83.3935 150.7235 162.3324 206.4348 236.3290 266.8608 292.3296 371.6301 397.7752 473.1600 506.3572 569.6630 607.2945 616.5273 663.6559 719.6266 724.2693 812.4853 881.9233 918.8712 954.5159 960.3648 979.1690 1025.1331 1112.1673 1131.7773 1176.2105 1185.3482 1236.1139 1266.9051 1306.5642 1308.2531 1328.9474 1350.4655 1367.3553 1382.7716 1400.6663 1466.4671 1473.3535 1487.3544 1488.1386 1681.4792 1723.6338 2971.1104 2974.5236 2983.3570 2998.5116 3062.3343 3077.6385 3081.0338 3083.3750 3591.6381 3615.3497
redmass: 2.7993 4.7165 4.5035 6.7359 1.0559 1.2061 2.6718 3.7253 3.2707 3.4624 1.2238 3.1661 2.9900 10.5380 2.7168 1.5880 5.9653 5.0968 3.5827 3.0837 1.1819 2.8760 1.6534 2.2736 1.7822 2.1174 1.7695 2.5771 2.0752 1.9605 1.5027 1.7409 1.6704 2.3487 1.6722 1.7001 1.2307 1.2176 1.0467 1.0509 1.0528 1.0464 8.4078 9.5194 1.0383 1.0804 1.0368 1.0845 1.0993 1.0993 1.0996 1.0989 1.0803 1.0799
irintensity: 0.4485 0.0804 3.1526 1.3348 0.1657 1.2280 1.8000 3.4641 11.2898 11.4306 94.7776 9.6424 23.5470 11.9525 31.9044 99.2439 39.2713 46.8363 3.0327 8.5333 2.6374 12.8598 2.5592 6.3529 28.5706 5.5246 16.6934 75.3447 14.6212 58.6092 15.1140 84.0418 9.5538 62.9178 37.0163 16.9911 17.6822 11.3687 2.4309 6.0566 17.8096 15.3423 559.4907 357.8288 27.4758 25.2555 13.1017 9.2347 36.0625 10.3206 36.7935 50.8209 69.7374 39.9328
temp: 298.150 k
press: 1.00000 atm
elementType: 8 8 7 7 6 6 6 6 6 6 1 1 1 1 1 1 1 1 1 1
symmnumber: 1
zpe: 424424.0 jmol-1
zpe.correction: 0.161655 hartree
zpe.thermalcorrener: 0.171750 hartree
zpe.thermalcorrenthalpy: 0.172695 hartree
zpe.thermalcorrgfe: 0.126238 hartree
zpe.sumelectzpe: -493.856916 hartree
zpe.sumelectthermal: -493.846821 hartree
zpe.sumelectthermalent: -493.845876 hartree
zpe.sumelectthermalfe: -493.892333 hartree
dipole: -2.9573 -1.2370 -0.8377
dipole: 3.3132
quadrupole: -62.6408 -69.8025 -57.7337
quadrupole: 9.6825 0.1164 3.6327
quadrupole: 0.7515 -6.4101 5.6586 9.6825 0.1164 3.6327
hfenergy: -494.0185709 hartree
pointgroup: C01 [X(C6H10N2O2)]
dipole: 1.1531159 0.5065256 -0.336003 debye
dipolederiv: -0.5417941 0.1458037 0.0184754 0.2009249 -1.1238343 0.0179128 0.0124678 0.0895805 -0.3594942 -1.1113722 0.3353693 0.1146083 0.485879 -0.778094 -0.0416149 0.1616445 -0.0310552 -0.394112 -1.1424424 -0.0627547 0.0922274 -0.0656569 -0.4192588 -0.0109965 0.0930498 0.0321518 -0.540429 -0.8471325 0.55336 0.0070888 0.3212725 -1.1726076 0.0404283 0.0933157 -0.0320279 -0.360711 0.1264346 -0.3099939 0.0979576 -0.4715031 0.0534636 0.1466768 0.1427708 0.1537638 0.2368337 0.2314443 0.097273 -0.0044159 0.0301582 0.0810932 -0.0024781 0.0546089 0.0285054 0.1217796 1.133866 -0.5549373 -0.1415088 -0.2510135 1.3613029 -0.031858 -0.2891372 -0.054995 0.2716548 -0.0355132 -0.0915488 0.0090766 -0.0453194 0.0441436 0.0295334 -0.0362437 0.0370184 0.0146206 -0.0238908 -0.0429898 0.0045135 -0.0306701 0.048192 0.0041099 0.0073734 -0.0131054 -0.0976275 1.7718442 -0.2835103 -0.3250936 -0.4548922 1.6050222 -0.1144419 -0.4055217 -0.1655978 0.4266259 0.0280845 0.0432235 0.0317528 0.0682527 0.0353782 -0.0228554 0.0368405 -0.0504143 -0.1100867 -0.0013857 0.0458551 0.0256816 0.0741109 -0.0853684 -0.0311552 0.0005793 -0.0284124 0.0348734 0.2201838 0.0107969 0.0668314 0.0383562 0.1627183 0.0216994 0.0990181 0.0052739 0.3377011 0.0419179 0.1382764 0.0169911 0.065041 -0.121623 0.0025515 0.0312576 -0.031834 0.0790385 -0.1369942 -0.038453 -0.0759215 -0.021385 0.077405 0.0096094 -0.1162165 -0.0015918 0.0504573 0.097642 -0.0117081 0.020565 0.0025599 0.0639336 -0.0477481 0.0651381 -0.014335 -0.1794991 0.0485357 0.1081097 0.0434005 0.0964235 -0.0758591 -0.0461801 0.0210084 0.0186797 0.068576 -0.1176101 -0.0211145 -0.1314461 -0.0245646 0.0990773 -0.0277081 -0.1025022 -0.024001 0.0236777 0.0299331 -0.0923857 0.0877201 -0.0832204 -0.0352697 0.0828267 0.0761519 0.0485133 0.033151 0.2282491 0.0313285 0.0414957 0.0652463 0.1801848 0.0216882 0.0543963 0.0338827 0.3429697 unknown
polarizability: 96.79667|-6.3227669|85.0546931|-6.1872877|-2.3372765|61.187014 unknown
InChI: InChI=1S/C6H10N2O2/c1-3(2)4-5(9)8-6(10)7-4/h3-4,7-8H,1-2H3
charge 0 multiplicity 1
20 atoms
O  -0.059623 -2.476699 -0.013775
O  -2.670124 1.455207 0.115615
N  -0.430223 1.029501 -0.584631
N  -1.628844 -0.702316 0.178975
C  0.483947 -0.120934 -0.684315
C  1.823543 0.019689 0.102339
C  -0.39642 -1.276397 -0.14567
C  2.71454 1.106006 -0.54323
C  1.594819 0.290365 1.605834
C  -1.683707 0.707919 -0.080748
H  0.726771 -0.340743 -1.744687
H  2.322644 -0.964115 -0.008034
H  -0.210393 1.97572 -0.887116
H  2.268909 2.113238 -0.428711
H  3.70514 1.132402 -0.055355
H  2.875033 0.918315 -1.621627
H  1.034087 1.230474 1.761213
H  2.564144 0.383297 2.127275
H  1.034933 -0.531618 2.086954
H  -2.424376 -1.210311 0.565695
