program: Gaussian 09
title: 000103026
version: EM64L-G09RevD.01
frameworkgroup: C1[X(C6H13NO7)]
method: RPBEPBE
basis: SDD
operation: Freq
keyword: #p
keyword: freq=noraman
keyword: PBEPBE/SDD
title: #p freq=noraman PBEPBE/SDD
converged: YES YES NO NO
title: Mulliken charges:
elementType: O O O O O O O N C C C C C C H H H H H H H H H H H H H
charge: -0.491139 -0.497799 -0.419645 -0.482343 -0.454803 -0.218745 -0.188309 0.165137 -0.146887 -0.094531 -0.100923 -0.127396 -0.400276 -0.387933 0.223053 0.259728 0.270278 0.231043 0.244145 0.288548 0.258270 0.208820 0.387697 0.384116 0.359742 0.373812 0.356339
chargesum: 0.00000
title: Mulliken charges with hydrogens summed into heavy atoms:
elementType: O O O O O O O N C C C C C C
charge: -0.103442 -0.113683 -0.059903 -0.108532 -0.098463 -0.218745 -0.188309 0.165137 0.076166 0.165197 0.169355 0.103647 0.132418 0.079157
polarizability: 1.18101391e+02 -4.63846671e+00 1.00826211e+02 -9.58653275e-01 3.56631303e+00 7.50829710e+01
1716.lowfreq: -18.0835 -7.6771 -0.0006 -0.0002 0.0008 5.9922 23.9862 35.2239 54.8383
frequency: 23.6171 34.9565 54.8340 64.1428 82.0202 109.6745 118.3566 138.9558 201.3098 215.9617 254.3383 283.0789 297.7655 304.3819 325.9849 382.7450 410.7369 477.8219 478.1671 515.8535 530.2207 536.4509 571.0221 606.6462 610.6992 626.8376 683.5110 737.7289 828.7983 851.9209 856.3613 895.6213 908.5521 952.4936 993.6044 1022.5486 1025.8135 1042.2846 1065.4965 1083.3100 1087.6823 1142.2075 1155.5007 1192.0129 1219.6062 1233.9406 1246.1907 1265.2305 1298.2712 1305.0567 1312.0149 1320.7481 1328.6421 1331.7957 1345.1774 1371.3151 1378.8585 1396.9044 1401.2371 1430.3031 1439.7247 1454.7426 2963.8235 2970.0014 2996.4456 3001.1529 3033.0777 3055.4777 3099.0007 3138.0561 3462.5796 3482.6785 3491.5466 3500.6210 3570.5970
redmass: 6.2723 9.4735 8.2251 4.5496 4.4242 6.6364 3.4738 5.4531 6.0423 6.8032 5.3865 5.6338 3.6624 3.5558 1.2295 4.5520 3.0546 3.0840 3.0440 1.7479 2.1093 1.1111 1.2067 2.8017 1.3996 3.5448 3.8955 4.6894 3.2000 3.6492 7.0174 2.8507 2.5067 5.6442 3.0359 2.1621 3.6912 2.3308 3.0272 2.5297 3.1168 1.2608 1.1749 1.1797 1.4124 2.9783 1.1705 1.2573 1.1955 1.3238 1.2877 1.2683 1.4087 1.3214 1.1690 1.4689 1.2951 1.5567 1.7043 2.0261 1.6322 1.0822 1.0838 1.0825 1.0660 1.0853 1.0621 1.0855 1.1010 1.1023 1.0647 1.0646 1.0645 1.0651 1.0666
irintensity: 5.4989 0.8569 1.3133 4.2038 6.6351 3.4453 7.1053 3.8127 5.5104 0.9897 7.9176 20.6319 24.7557 41.1603 54.7744 12.1995 2.4626 18.1188 19.5368 59.0407 69.8246 128.9027 162.5304 118.8693 140.7761 27.7652 27.8822 25.9064 6.5530 32.3585 29.5521 1.9082 17.8306 96.5176 71.6771 14.0656 109.1325 22.2444 84.5983 20.6255 12.0509 41.3674 34.7651 77.1521 14.6512 95.6305 25.5556 11.1949 15.9017 20.9067 22.2711 30.9406 9.9903 4.6836 10.9727 74.7904 31.0570 38.6774 5.3921 132.1932 39.8673 5.8905 30.7213 27.6512 47.4295 45.8061 7.8450 14.1390 11.5642 1.9569 60.4562 32.2296 63.2305 34.3569 14.4473
temp: 298.150 k
press: 1.00000 atm
elementType: 8 8 8 8 8 8 8 7 6 6 6 6 6 6 1 1 1 1 1 1 1 1 1 1 1 1 1
symmnumber: 1
zpe: 548050.2 jmol-1
zpe.correction: 0.208741 hartree
zpe.thermalcorrener: 0.224432 hartree
zpe.thermalcorrenthalpy: 0.225376 hartree
zpe.thermalcorrgfe: 0.163961 hartree
zpe.sumelectzpe: -816.488757 hartree
zpe.sumelectthermal: -816.473067 hartree
zpe.sumelectthermalent: -816.472122 hartree
zpe.sumelectthermalfe: -816.533537 hartree
dipole: -4.2648 0.6518 -2.2273
dipole: 4.8554
quadrupole: -106.1214 -79.3927 -86.3536
quadrupole: -8.1959 -7.5290 -0.4988
quadrupole: -15.4989 11.2299 4.2690 -8.1959 -7.5290 -0.4988
hfenergy: -816.6974984 hartree
pointgroup: C01 [X(C6H13N1O7)]
dipole: -1.6599023 -0.3565018 0.8756141 debye
polarizability: 117.480197|5.6418528|101.4509565|0.7618229|3.6046927|75.0794194 unknown
InChI: InChI=1S/C6H13NO7/c8-2-4(10)6(12)5(11)3(9)1-7(13)14/h3-6,8-12H,1-2H2
charge 0 multiplicity 1
27 atoms
O  0.210012 2.290843 0.805867
O  -2.376958 1.719205 0.482663
O  1.363904 1.047417 -1.357732
O  -3.42959 -0.2301 -1.011372
O  -3.274782 -2.437801 0.558724
O  3.122777 -1.7596 -0.243366
O  4.56497 -0.019171 0.078679
N  3.409223 -0.568759 0.158688
C  -0.153585 0.884053 0.573092
C  -1.448984 0.848996 -0.258316
C  1.061056 0.275365 -0.157479
C  -2.097784 -0.537781 -0.458329
C  2.277792 0.228446 0.792279
C  -2.287497 -1.367211 0.829639
H  -0.322345 0.378931 1.547128
H  -1.250202 1.279225 -1.260966
H  0.847174 -0.749727 -0.506419
H  -1.512939 -1.120355 -1.201584
H  2.028892 -0.299517 1.73004
H  2.665949 1.232789 1.013027
H  -2.747302 -0.751614 1.619556
H  -1.331549 -1.790493 1.19523
H  -0.64097 2.77839 0.97704
H  -3.270597 1.581935 0.064589
H  1.317269 2.00635 -1.089543
H  -4.001867 -1.023571 -0.816725
H  -2.825865 -3.208645 0.128193
