program: Gaussian 09
title: 000103023
version: EM64L-G09RevD.01
frameworkgroup: C1[X(C6H12O5)]
method: RPBEPBE
basis: SDD
operation: Freq
keyword: #pfreq=noraman
keyword: PBEPBE/SDD
title: #p freq=noraman PBEPBE/SDD
converged: YES YES NO NO
title: Mulliken charges:
elementType: O O O O O C C C C C C H H H H H H H H H H H H
charge: -0.288442 -0.459418 -0.435814 -0.492753 -0.448553 -0.164947 -0.162758 -0.150506 -0.080604 -0.372743 -0.315572 0.259233 0.263339 0.253474 0.251331 0.258831 0.224242 0.234835 0.177940 0.355128 0.365292 0.368050 0.360414
chargesum: 0.00000
title: Mulliken charges with hydrogens summed into heavy atoms:
elementType: O O O O O C C C C C C
charge: -0.288442 -0.104290 -0.070522 -0.124703 -0.088139 0.094286 0.100581 0.102968 0.170727 0.110329 0.097203
polarizability: 9.24414761e+01 -3.42539568e-01 7.85304353e+01 9.83515388e-01 2.45414693e-01 6.77270056e+01
1716.lowfreq: -6.0257 0.0006 0.0011 0.0011 13.4382 20.4537 50.3221 82.2532 98.0952
frequency: 49.6420 82.1132 98.0474 125.6526 170.4318 216.2808 240.6285 283.8726 306.1125 326.6565 381.5668 422.6733 431.2215 448.5405 467.4837 498.0005 503.1749 567.4224 714.7212 767.6713 821.2998 843.9954 853.7054 880.7787 938.3254 955.2690 984.8014 1019.0703 1037.1859 1042.5763 1057.2465 1060.3119 1093.0637 1161.8149 1166.7876 1172.8760 1193.7827 1250.2987 1255.4253 1259.9359 1279.3689 1285.8029 1309.0919 1326.6152 1353.8405 1360.2175 1362.4058 1375.1876 1394.8950 1461.5441 1464.7029 2942.9149 3003.2579 3018.4741 3027.4983 3042.6441 3085.2854 3097.8719 3111.7953 3521.4909 3531.4228 3544.1470 3579.1579
redmass: 6.2682 5.4842 3.3462 3.9533 5.0723 4.3285 4.7490 2.1205 1.5784 4.5547 4.2005 1.9359 1.2553 2.6073 1.3197 1.1356 3.7474 3.9895 5.1428 4.5554 4.4448 3.2364 2.9020 2.6090 2.8669 3.8238 4.4622 3.4957 2.4551 2.4296 2.0109 2.0265 2.8482 1.1710 1.2004 1.3656 1.3900 1.2025 1.3655 1.2831 1.2336 1.3257 1.2809 1.3135 1.2594 1.3183 1.3598 1.3957 1.3509 1.0886 1.0813 1.0698 1.0640 1.0846 1.0861 1.0878 1.0887 1.0934 1.1025 1.0650 1.0655 1.0653 1.0666
irintensity: 1.2129 3.3480 2.9996 2.9693 6.6283 1.7123 15.0576 47.3639 99.8094 10.9921 7.4347 22.5444 86.4405 52.4732 180.0508 164.8964 3.1236 16.4336 34.7320 11.6996 10.9859 1.8612 46.7925 38.9725 22.8514 101.8854 19.3697 48.2848 107.4221 35.6263 29.5533 73.3912 8.2038 24.6055 20.0764 21.1795 4.7864 68.2919 8.6633 31.1539 7.3190 1.2882 8.7039 3.1600 6.9700 11.6039 81.9696 10.1663 19.7962 9.5100 1.8161 64.8783 34.0192 6.8223 6.7250 60.1306 25.6133 21.4356 15.1734 16.4754 8.9341 20.5247 11.8212
temp: 298.150 k
press: 1.00000 atm
elementType: 8 8 8 8 8 6 6 6 6 6 6 1 1 1 1 1 1 1 1 1 1 1 1
symmnumber: 1
zpe: 488256.4 jmol-1
zpe.correction: 0.185967 hartree
zpe.thermalcorrener: 0.197732 hartree
zpe.thermalcorrenthalpy: 0.198676 hartree
zpe.thermalcorrgfe: 0.148400 hartree
zpe.sumelectzpe: -611.000606 hartree
zpe.sumelectthermal: -610.988841 hartree
zpe.sumelectthermalent: -610.987897 hartree
zpe.sumelectthermalfe: -611.038173 hartree
dipole: -3.7524 0.6482 -0.4210
dipole: 3.8312
quadrupole: -84.3176 -60.0366 -63.5506
quadrupole: -4.6231 5.8183 0.5137
quadrupole: -15.0160 9.2650 5.7510 -4.6231 5.8183 0.5137
hfenergy: -611.1865734 hartree
pointgroup: C01 [X(C6H12O5)]
dipole: 1.4742934 -0.2599967 -0.1755482 debye
dipolederiv: -0.8996565 0.0009983 0.1613596 -0.1078012 -0.4865822 0.0588714 0.1263456 0.0547524 -0.4798855 -0.4997302 -0.2693185 -0.0059698 -0.271065 -0.4469653 -0.1659141 -0.0141491 -0.2286857 -0.6238982 -0.5870229 -0.2262603 -0.1525868 -0.2178834 -0.3754539 0.0267406 -0.2228139 0.0500891 -0.6688292 -0.5430094 0.1831385 -0.0944788 0.1899263 -0.7773681 -0.0314694 -0.1303737 -0.0480205 -0.4923847 -0.9190301 0.0301733 -0.0092079 0.058311 -0.2572241 0.1137968 0.007648 0.1115421 -0.550266 0.401629 0.1909471 -0.0482756 0.1908886 0.1916826 -0.1549233 -0.0884136 -0.0760578 0.2730555 0.1583226 0.1655952 0.0448334 0.0454163 0.3429159 0.1298577 0.1117312 0.2281144 0.4126454 0.3729715 -0.005656 0.1073926 0.1575583 0.1999715 0.0667796 0.2451194 0.0929499 0.457488 0.1930993 -0.1516761 -0.0041173 -0.1735899 0.5036181 0.0929566 0.066613 0.0533184 0.2364993 0.4166924 -0.0192225 -0.1709837 -0.0932757 0.1340482 0.1577692 -0.2237482 -0.0080184 0.3116475 0.5795919 -0.1132052 0.1114661 0.0144531 0.2259909 -0.062007 0.0165997 -0.0338588 0.4334648 0.027823 -0.0226584 0.0342429 -0.024639 0.0269502 -0.0040798 0.026816 0.0079212 -0.1166633 0.0545077 -0.0278154 -0.0198032 -0.0071473 -0.0649494 0.0708165 -0.027429 0.0604401 -0.0912473 -0.0357798 0.0808181 0.0433028 0.0681736 -0.003365 -0.0923204 0.0169078 -0.0736767 -0.0042375 0.0342618 0.0201719 0.027791 -0.0037513 0.0051742 0.0062474 0.0382356 -0.0354419 -0.121204 -0.0460259 -0.0880376 0.0454344 -0.0968212 -0.0018883 0.0125067 0.0272357 -0.0238814 0.0820447 0.0146263 0.014236 -0.0788442 0.0501148 0.0769523 -0.0561874 0.0020555 -0.0201677 -0.1503685 0.0739994 0.0464352 -0.0165298 0.0705419 -0.0891039 -0.0170714 -0.0089752 -0.0581234 0.0711333 -0.03062 0.0038951 -0.0579051 -0.0051055 0.0614982 -0.036195 -0.0490185 0.0330889 -0.2394233 0.2235565 0.1903063 -0.0177072 0.1508105 0.1652918 -0.0169786 -0.056464 0.0115208 0.3097679 0.2934857 0.1496002 0.0727023 0.115469 0.1682168 -0.077089 0.0808556 -0.0594089 0.3070335 0.2790261 -0.1556748 0.0733434 -0.1306049 0.2948062 0.0259666 0.1108739 0.0206447 0.3127137 0.4372817 0.0032098 -0.0454592 0.020021 0.1057834 -0.0480736 -0.0556518 -0.0590409 0.330914 unknown
polarizability: 92.4521836|-0.5030478|78.4223135|-0.6283709|1.1788834|67.8244199 unknown
InChI: InChI=1S/C6H12O5/c7-1-3(8)6-5(10)4(9)2-11-6/h3-10H,1-2H2
charge 0 multiplicity 1
23 atoms
O  0.907825 1.406906 0.084964
O  0.401523 -1.67871 -1.019739
O  3.128078 -0.197709 1.096154
O  -1.840139 1.623829 0.151485
O  -3.631762 -0.415693 -0.110632
C  0.108216 0.202537 0.528252
C  0.974088 -1.037918 0.173467
C  2.373356 -0.420492 -0.140991
C  -1.27563 0.290014 -0.138208
C  1.978573 0.899102 -0.815829
C  -2.304064 -0.698533 0.431641
H  -0.004748 0.31599 1.621804
H  1.051256 -1.745379 1.019857
H  3.001167 -1.082733 -0.75787
H  -1.180091 0.144323 -1.230249
H  2.779781 1.653452 -0.824326
H  1.586706 0.725795 -1.836471
H  -2.055117 -1.726053 0.125026
H  -2.308204 -0.624973 1.54191
H  0.836617 -2.555953 -1.161993
H  2.740873 0.595229 1.552544
H  -1.150843 2.296135 -0.089088
H  -3.754262 0.568733 -0.045708
