program: Gaussian 09
title: 000008970
version: EM64L-G09RevD.01
frameworkgroup: C1[X(C20H30O4)]
method: RPBEPBE
basis: SDD
operation: Freq
keyword: #pfreq=noraman
keyword: PBEPBE/SDD
title: #p freq=noraman PBEPBE/SDD
converged: YES YES NO NO
title: Mulliken charges:
elementType: O O O O C C C C C C C C C C C C C C C C C C C C H H H H H H H H H H H H H H H H H H H H H H H H H H H H H H
charge: -0.270866 -0.270665 -0.248462 -0.248328 -0.021512 -0.021506 -0.346548 -0.346461 -0.415427 -0.415520 -0.716458 -0.716764 -0.716454 -0.716755 -0.291745 -0.291653 0.191028 0.191777 0.170818 0.170640 -0.371963 -0.372114 -0.220713 -0.220715 0.195666 0.195654 0.234913 0.162656 0.234817 0.162660 0.205651 0.211269 0.205660 0.211274 0.202626 0.217533 0.214211 0.199206 0.211465 0.229297 0.202629 0.217543 0.214212 0.199212 0.211479 0.229262 0.237344 0.230621 0.237236 0.230687 0.267282 0.267196 0.238555 0.238550
chargesum: 0.00000
title: Mulliken charges with hydrogens summed into heavy atoms:
elementType: O O O O C C C C C C C C C C C C C C C C C C C C
charge: -0.270866 -0.270665 -0.248462 -0.248328 0.174154 0.174149 0.051021 0.051015 0.001493 0.001414 -0.082088 -0.076797 -0.082070 -0.076803 0.176221 0.176269 0.191028 0.191777 0.170818 0.170640 -0.104681 -0.104918 0.017842 0.017835
polarizability: 2.77475356e+02 8.81815874e-04 1.95151912e+02 -3.51072030e-03 2.01071112e+01 2.17793974e+02
1716.lowfreq: -0.0007 -0.0005 0.0000 1.9536 4.5926 8.8053 14.4565 25.8784 30.3103
frequency: 14.1478 25.7385 30.0754 32.4604 39.6524 40.4724 41.3811 66.3591 79.8780 84.7547 106.4172 111.2522 120.3183 135.0217 163.6136 177.1966 180.0385 206.2880 208.4673 217.0575 222.8937 235.8310 240.5686 241.5307 264.1181 269.1503 315.2393 342.8783 361.5037 362.0090 386.7355 390.1196 398.2218 415.1695 432.1267 432.6113 471.5969 477.0849 528.2228 541.7788 639.8425 673.6593 683.0325 709.2622 738.4828 745.3522 780.2885 786.5468 797.0163 809.4775 817.3639 827.5037 857.5236 858.8647 880.0730 880.9658 905.3811 914.8931 914.9133 948.6624 949.0804 962.0033 962.2619 976.7406 986.2067 988.5693 1003.6279 1028.4790 1031.7103 1034.5914 1037.5496 1088.4950 1089.5452 1095.3717 1101.3026 1135.2384 1135.6018 1147.5613 1147.7451 1176.3127 1178.6556 1178.7277 1205.7976 1206.1546 1225.3827 1229.5476 1229.5884 1250.8207 1275.1659 1276.2445 1279.6898 1293.3862 1293.4981 1327.1955 1327.7564 1333.9990 1335.0910 1359.2108 1360.4758 1364.5286 1365.2494 1376.3110 1376.4476 1380.4780 1393.8695 1393.9025 1431.4913 1449.5969 1449.6663 1466.2652 1466.3223 1470.8951 1471.4220 1472.1515 1472.6174 1476.8065 1479.5233 1481.4557 1482.1285 1482.5775 1489.7118 1490.0286 1575.8313 1604.7453 1614.2022 1623.7819 2940.0045 2940.8933 2959.6615 2959.9767 2965.0235 2965.1314 2968.8515 2968.8976 2984.8361 2985.1476 3004.4121 3004.4782 3022.7663 3023.1286 3048.6327 3049.1523 3056.1948 3056.2035 3064.4100 3064.8673 3068.4391 3068.5315 3071.2683 3072.2035 3072.7191 3072.9152 3137.6742 3150.6698 3162.1798 3173.5190
redmass: 3.9656 4.3839 5.4718 4.4426 2.6390 3.1350 4.2159 4.6294 3.9057 3.8866 5.7964 2.7394 2.2075 3.1138 3.2552 2.9566 2.6067 1.1493 1.1678 4.8886 3.6922 1.9739 1.1137 1.2310 5.8768 2.4677 3.6480 4.5275 2.2887 2.3119 8.3516 2.7321 2.7846 3.6880 2.0751 2.0889 2.8748 2.8143 4.1961 4.5877 6.5782 6.2440 6.1482 4.2590 1.5616 1.4739 4.1163 1.4768 4.4958 2.9107 2.1308 2.3723 2.5703 3.5712 2.2347 2.2873 1.4751 1.1742 1.1744 1.4683 1.4721 1.4850 1.4878 1.4044 1.9542 1.9383 1.3554 2.7145 2.2053 2.4953 7.9447 2.1030 2.1880 3.2470 1.9688 2.2347 2.2613 1.7164 1.7320 1.0607 1.7593 1.7552 1.4648 1.4924 2.0502 1.2574 1.3823 3.2726 1.2652 1.2608 1.5440 1.1343 1.1417 1.4271 1.4199 1.4268 1.4242 1.3932 1.4465 1.6000 1.5980 1.2201 1.2223 9.2606 1.2215 1.2200 2.2808 1.0775 1.0782 1.0681 1.0689 1.1003 1.0479 1.2297 1.0806 1.7374 1.0791 1.0953 1.0560 1.0741 1.0494 1.0499 7.2416 6.5303 11.0423 11.3770 1.0671 1.0674 1.0792 1.0788 1.0358 1.0359 1.0373 1.0372 1.0596 1.0597 1.0595 1.0600 1.0937 1.0931 1.1008 1.1010 1.0989 1.0989 1.0984 1.0985 1.0997 1.0998 1.1068 1.1066 1.0994 1.0998 1.0859 1.0901 1.0949 1.1009
irintensity: 0.0065 0.3578 1.4937 0.1976 0.1081 0.7083 1.7749 0.6631 0.2877 2.6879 0.0478 1.3353 0.0272 1.3505 0.4403 0.2766 0.0224 1.1478 0.9226 8.7578 2.6673 2.9335 0.0708 1.7988 0.7387 0.3642 1.6466 2.7155 1.7717 2.5483 7.1323 0.8856 0.0090 2.1399 0.0133 1.9668 3.4957 5.5311 1.0511 3.4879 1.9904 0.2690 11.9554 64.0811 6.7037 2.2778 1.3058 44.7273 3.2831 1.9257 0.7823 3.0139 28.3628 9.3657 0.3524 1.6172 0.0012 4.3551 0.2299 6.8890 0.8640 7.9720 2.0349 1.5287 1.4236 16.5023 2.0630 53.6279 0.1832 67.4112 131.3267 7.4678 10.2215 276.3736 47.9827 1.8823 3.6478 1.4208 0.3200 0.3747 11.8050 9.4727 3.1246 16.8419 61.4471 13.1482 17.3961 414.1404 0.7209 0.4786 15.9990 0.8882 4.4381 5.4387 6.8592 2.8837 3.0225 9.1142 0.1598 0.0272 1.0798 12.7107 28.7283 6.1765 8.1359 22.4169 6.0711 0.7227 7.4119 2.1536 0.0072 0.6838 5.3912 3.0625 13.9102 0.0324 12.9475 7.0725 2.0147 6.6264 64.3813 0.2715 0.0895 57.7828 337.7182 11.4774 42.6269 0.3474 53.7081 8.1715 2.8592 64.3179 6.0993 64.7535 63.3858 1.5020 26.8223 8.1405 4.7385 1.4725 14.6018 54.4635 12.9517 8.1324 157.9102 29.0386 0.1793 66.5306 48.8169 63.2429 54.8535 46.9871 1.6820 5.6777 6.4058 23.6784
temp: 298.150 k
press: 1.00000 atm
elementType: 8 8 8 8 6 6 6 6 6 6 6 6 6 6 6 6 6 6 6 6 6 6 6 6 1 1 1 1 1 1 1 1 1 1 1 1 1 1 1 1 1 1 1 1 1 1 1 1 1 1 1 1 1 1
symmnumber: 1
zpe: 1205287.1 jmol-1
zpe.correction: 0.459070 hartree
zpe.thermalcorrener: 0.486334 hartree
zpe.thermalcorrenthalpy: 0.487278 hartree
zpe.thermalcorrgfe: 0.398132 hartree
zpe.sumelectzpe: -1079.176278 hartree
zpe.sumelectthermal: -1079.149014 hartree
zpe.sumelectthermalent: -1079.148069 hartree
zpe.sumelectthermalfe: -1079.237216 hartree
dipole: -0.3017 0.0024 -0.0041
dipole: 0.3017
quadrupole: -125.3636 -149.9820 -148.2065
quadrupole: -0.0116 -0.0184 -9.8509
quadrupole: 15.8204 -8.7980 -7.0225 -0.0116 -0.0184 -9.8509
hfenergy: -1079.6353475 hartree
pointgroup: C01 [X(C20H30O4)]
dipole: -0.1186827 -0.0010639 0.0016856 debye
polarizability: 277.4753045|0.0446541|193.6217251|-0.0490058|19.1652417|219.3242116 unknown
InChI: InChI=1S/C20H30O4/c1-15(2)9-7-13-23-19(21)17-11-5-6-12-18(17)20(22)24-14-8-10-16(3)4/h5-6,11-12,15-16H,7-10,13-14H2,1-4H3
charge 0 multiplicity 1
54 atoms
O  0.434565 0.786879 -1.228168
O  0.438554 -0.78701 1.229205
O  1.111796 -1.083379 -2.448655
O  1.111492 1.088677 2.443611
C  -2.611449 3.648566 0.139326
C  -2.605972 -3.651517 -0.135551
C  -1.965649 2.288067 -0.235777
C  -1.96137 -2.290268 0.23889
C  -1.507503 2.179405 -1.70733
C  -1.50204 -2.180963 1.710008
C  -3.914685 3.921362 -0.650233
C  -2.876979 3.708495 1.66262
C  -3.908206 -3.925728 0.655159
C  -2.87277 -3.71184 -1.658611
C  -0.820447 0.854675 -2.040139
C  -0.815931 -0.855553 2.041998
C  2.551252 -0.172915 -0.691659
C  2.551779 0.177273 0.687671
C  1.309008 -0.254941 -1.526743
C  1.310108 0.25824 1.523934
C  3.783024 -0.381666 -1.358799
C  3.783945 0.387256 1.353617
C  5.006709 -0.199397 -0.68045
C  5.007167 0.20614 0.674078
H  -1.881315 4.447738 -0.112673
H  -1.874721 -4.449853 0.115863
H  -1.088586 2.120003 0.418656
H  -2.693431 1.475084 -0.018092
H  -1.085079 -2.121244 -0.416335
H  -2.690255 -1.478115 0.021793
H  -2.376146 2.274756 -2.388712
H  -0.817585 3.012275 -1.947009
H  -2.369989 -2.277028 2.39217
H  -0.811129 -3.013149 1.949222
H  -4.656399 3.1195 -0.465359
H  -3.739049 3.977972 -1.739965
H  -4.369892 4.879111 -0.336679
H  -3.605781 2.929982 1.962845
H  -3.293869 4.689259 1.958325
H  -1.947578 3.543346 2.238528
H  -4.650955 -3.124671 0.470955
H  -3.731539 -3.98216 1.744735
H  -4.362649 -4.88397 0.342003
H  -3.602813 -2.934251 -1.958223
H  -3.28869 -4.693133 -1.953917
H  -1.94409 -3.54554 -2.235354
H  -0.543237 0.777502 -3.107169
H  -1.443662 -0.019885 -1.776091
H  -0.538042 -0.777958 3.108828
H  -1.439997 0.018449 1.77813
H  3.764028 -0.671891 -2.414125
H  3.76577 0.677521 2.408943
H  5.952381 -0.358991 -1.208994
H  5.9532 0.366686 1.201695
