program: Gaussian 09
title: 000103013
version: EM64L-G09RevD.01
frameworkgroup: C1[X(C4H10N2O2S)]
method: RPBEPBE
basis: SDD
operation: Freq
keyword: #p
keyword: freq=noraman
keyword: PBEPBE/SDD
title: #p freq=noraman PBEPBE/SDD
converged: YES YES NO NO
title: Mulliken charges:
elementType: S O O N N C C C C H H H H H H H H H H
charge: 0.954393 -0.566973 -0.568261 -0.332882 -0.582005 0.003212 -0.585574 -0.455485 -0.570106 0.229882 0.295354 0.288207 0.238664 0.250079 0.281733 0.272893 0.262128 0.276321 0.308420
chargesum: 0.00000
title: Mulliken charges with hydrogens summed into heavy atoms:
elementType: S O O N N C C C C
charge: 0.954393 -0.566973 -0.568261 -0.070754 0.002736 0.233094 -0.002014 0.033259 -0.015480
polarizability: 1.03323231e+02 1.58292456e-01 8.31455618e+01 -7.76824127e-01 8.68857556e-01 7.78142433e+01
1716.lowfreq: -0.0023 -0.0013 -0.0011 1.7950 6.7992 13.3839 43.3602 80.3630 126.6820
frequency: 43.2068 80.3604 126.6807 194.9668 211.2504 258.0604 261.5624 290.3431 322.7101 394.0785 438.0346 452.8580 460.3599 500.5791 540.0456 627.9951 693.4691 792.5534 812.0447 838.3954 862.0084 930.9269 955.3993 993.6532 1048.9088 1068.1317 1096.4114 1153.9142 1167.9849 1180.4350 1185.1635 1234.7280 1242.7496 1281.6052 1333.1300 1353.8329 1414.9628 1425.5663 1457.7309 1472.5113 1651.9200 2900.5597 2997.9899 3059.5846 3068.5784 3075.0956 3163.1567 3181.3874 3351.5640 3425.4986 3599.9041
redmass: 4.3732 3.4154 3.3518 3.7336 3.1368 3.3054 7.0432 3.9456 1.4428 5.6839 1.8686 2.5106 2.0501 2.7255 4.2475 2.4481 1.7418 3.1446 2.6929 1.9391 2.4555 2.9041 1.2981 2.6633 2.0576 1.1930 2.3618 2.1589 1.4559 1.5821 1.4070 1.7676 1.2943 1.2840 1.3065 1.3015 1.1038 1.0992 1.0926 1.1745 1.0856 1.0829 1.0599 1.0736 1.0854 1.0559 1.1117 1.1119 1.0749 1.0465 1.0981
irintensity: 1.8822 1.0590 2.1290 2.9742 2.2922 1.3199 9.1491 23.7489 54.2363 28.7793 144.1313 62.8114 28.5843 7.8997 15.5134 49.9484 75.4440 27.3461 74.4285 6.5532 3.1971 81.9672 0.3760 8.0008 0.8368 11.2346 10.5314 3.1294 2.1693 1.8489 10.6574 0.5518 7.4428 1.4660 5.7502 11.7551 15.8411 10.5606 5.3170 11.4091 7.9025 51.9923 21.2643 4.5258 13.7564 1.6217 1.5660 0.0229 13.3182 8.0060 6.8487
temp: 298.150 k
press: 1.00000 atm
elementType: 16 8 8 7 7 6 6 6 6 1 1 1 1 1 1 1 1 1 1
symmnumber: 1
zpe: 392821.0 jmol-1
zpe.correction: 0.149618 hartree
zpe.thermalcorrener: 0.160088 hartree
zpe.thermalcorrenthalpy: 0.161032 hartree
zpe.thermalcorrgfe: 0.113531 hartree
zpe.sumelectzpe: -815.491689 hartree
zpe.sumelectthermal: -815.481219 hartree
zpe.sumelectthermalent: -815.480275 hartree
zpe.sumelectthermalfe: -815.527776 hartree
dipole: 7.6540 3.6403 -1.2110
dipole: 8.5617
quadrupole: -63.9632 -57.9918 -68.1841
quadrupole: -6.4692 -0.8258 -3.5409
quadrupole: -0.5835 5.3879 -4.8044 -6.4692 -0.8258 -3.5409
hfenergy: -815.6413065 hartree
pointgroup: C01 [X(C4H10N2O2S1)]
dipole: 2.9551108 -1.4764394 0.6585298 debye
dipolederiv: 1.3652905 -0.1143269 0.0353321 -0.0683798 1.1765753 0.0087235 0.0476679 0.0162508 1.2024415 -0.6395865 0.0402233 -0.0554961 -0.0214077 -0.5197371 -0.0256978 -0.2304352 0.0785822 -0.6899152 -0.654386 0.0525431 0.0269038 0.111249 -0.5912668 -0.0395045 0.2096248 -0.1453986 -0.6229889 -0.1785915 0.1345757 0.0590462 -0.0381555 0.1012947 -0.0272618 0.1199668 -0.0275705 -0.5086807 -0.5416805 0.1732256 0.1252953 0.4002489 -0.392376 -0.0118748 0.0590456 -0.1276982 -0.0006567 0.50262 -0.045978 -0.0994279 -0.2643625 0.0722806 -0.0128696 0.1774856 0.0034085 0.3878977 -0.1194179 0.0306331 -0.0083731 0.0787762 -0.1222703 0.0273577 -0.121373 0.0198801 -0.0950205 -0.1133291 -0.0582368 0.0214811 0.002705 -0.0918489 -0.0115168 -0.0369356 0.097963 0.0912521 -0.031194 -0.0162095 0.0012014 -0.0490558 -0.1249929 0.0209577 0.0058977 0.0019085 -0.0402041 -0.0513587 -0.0078948 0.0263572 0.0253661 0.0089298 -0.0214509 0.0445498 -0.0083085 -0.213255 0.0287233 -0.0265289 0.004068 0.0158998 0.0047512 -0.0235616 0.0162675 -0.0427868 0.0800526 0.0268455 -0.0315326 0.0355763 -0.0051578 0.095294 -0.0088467 -0.0296206 0.0149208 -0.0129319 -0.0015167 0.1597833 -0.055249 0.082604 -0.0344119 0.062938 -0.035592 0.0640754 0.0575404 0.0617334 0.0058553 0.0201499 -0.0054941 0.0807794 -0.0001959 0.0279704 -0.0646854 -0.0863377 0.0036205 -0.0288405 -0.0297726 -0.047445 0.0092629 -0.0186291 -0.0573366 -0.0274601 0.067346 0.0559012 0.0504101 0.0021137 0.0404737 0.0207028 0.018253 0.0461291 0.0160935 -0.046114 0.0160681 -0.0188308 -0.0154392 0.0103148 -0.1269224 0.0202207 -0.1033803 0.1194506 0.2731948 0.1175251 -0.1487914 -0.127332 -0.1532296 0.1827103 0.0611015 -0.1578888 0.0056901 0.0457205 0.1527335 -0.1500793 0.0335648 -0.1149497 0.2512454 -0.0181425 0.0179568 0.0056847 0.1106589 unknown
polarizability: 103.1982526|-0.5892739|83.2234076|1.852729|0.603889|77.861376 unknown
InChI: InChI=1S/C4H10N2O2S/c5-6-4-1-2-9(7,8)3-4/h4,6H,1-3,5H2
charge 0 multiplicity 1
19 atoms
S  -1.636282 0.344774 -0.094041
O  -2.35086 0.328648 -1.566628
O  -2.329051 1.106485 1.178885
N  2.40063 -0.264067 -0.171997
N  3.180763 0.876313 0.156708
C  1.031302 -0.234851 0.376311
C  0.226358 0.902101 -0.272253
C  0.326892 -1.58788 0.047929
C  -1.152957 -1.492023 0.419429
H  1.020272 -0.091658 1.483742
H  0.291554 1.871477 0.236683
H  0.403879 0.970574 -1.355382
H  0.808733 -2.41372 0.605402
H  0.443456 -1.789087 -1.033155
H  -1.830529 -2.134816 -0.158648
H  -1.360469 -1.527094 1.499455
H  2.866174 -1.173218 -0.014566
H  3.683604 0.872118 1.052049
H  3.693331 1.261923 -0.636421
