program: Gaussian 09
title: 000103011
version: EM64L-G09RevD.01
frameworkgroup: C1[X(C6H11N2O2)]
method: RPBEPBE
basis: SDD
operation: Freq
keyword: #p
keyword: freq=noraman
keyword: PBEPBE/SDD
title: #p freq=noraman PBEPBE/SDD
converged: YES YES NO NO
title: Mulliken charges:
elementType: O O N N C C C C C C H H H H H H H H H H H
charge: -0.125603 -0.053535 0.044960 -0.110612 -0.074771 -0.340905 -0.630445 -0.662245 -0.155766 0.178229 0.236005 0.233155 0.222622 0.255273 0.234740 0.274834 0.234848 0.224538 0.262410 0.354432 0.397834
chargesum: 1.00000
title: Mulliken charges with hydrogens summed into heavy atoms:
elementType: O O N N C C C C C C
charge: -0.125603 -0.053535 0.044960 0.287223 0.161234 0.114873 0.134402 0.059551 0.198666 0.178229
polarizability: 1.17171855e+02 -8.99399794e+00 8.06571330e+01 1.22111063e+00 -9.40801557e+00 6.35448657e+01
1716.lowfreq: -8.4531 -2.9671 -0.0006 -0.0003 0.0003 21.6802 23.1552 72.8320 92.9803
frequency: 22.1217 72.8247 92.9524 158.3932 202.1044 221.9002 253.0059 271.1548 306.2905 346.2216 371.5589 418.9492 472.2178 566.6759 583.3166 625.8385 652.6160 719.0720 782.4586 812.0170 841.8460 924.3372 962.3577 978.4113 1016.8133 1037.7011 1069.6402 1076.2955 1090.9065 1135.7559 1167.4451 1254.6346 1269.4910 1303.3798 1316.9199 1331.9004 1354.4138 1398.6865 1409.7887 1459.5452 1470.2952 1475.9182 1481.2073 1485.9939 1551.0855 1823.4057 2990.9923 2999.6616 3005.9019 3010.3627 3052.0579 3097.5126 3107.6918 3109.6080 3118.3485 3260.5383 3444.3009
redmass: 3.5802 2.1454 4.0606 2.9306 1.0738 3.1492 1.4169 2.9569 3.3544 4.8697 2.0090 3.9295 3.1444 4.5288 6.5025 3.4047 3.2843 6.0303 1.3377 1.4980 1.8639 4.5001 1.5341 1.3264 3.0194 3.5989 3.3347 2.4562 2.0747 2.1533 1.9296 1.3366 1.4275 1.2940 1.3178 1.4534 1.4958 1.1873 1.1801 1.0546 1.0450 1.0459 1.0768 1.0461 4.0762 12.5603 1.0606 1.0372 1.0413 1.0801 1.1034 1.1001 1.1004 1.1022 1.0994 1.1002 1.0831
irintensity: 0.9017 2.0398 3.9190 3.5741 0.0673 1.1974 0.8456 0.9250 4.6995 33.2239 72.2052 7.0966 29.2586 72.9232 58.2406 11.1024 11.5208 73.1482 8.3995 33.5785 1.4102 5.6208 8.4122 2.3304 7.4185 6.8995 56.2499 44.6797 1.0859 0.8581 0.4328 1.0044 1.4833 0.4752 12.2926 33.4422 3.6085 16.9727 8.7516 0.4869 26.2617 19.1696 30.1519 9.1754 9.0971 374.9948 11.2745 10.7785 1.1915 5.2948 8.9913 19.0581 17.8534 9.5496 1.7497 40.9199 165.6792
temp: 298.150 k
press: 1.00000 atm
elementType: 8 8 7 7 6 6 6 6 6 6 1 1 1 1 1 1 1 1 1 1 1
symmnumber: 1
zpe: 447623.7 jmol-1
zpe.correction: 0.170491 hartree
zpe.thermalcorrener: 0.181453 hartree
zpe.thermalcorrenthalpy: 0.182398 hartree
zpe.thermalcorrgfe: 0.133106 hartree
zpe.sumelectzpe: -494.047015 hartree
zpe.sumelectthermal: -494.036052 hartree
zpe.sumelectthermalent: -494.035108 hartree
zpe.sumelectthermalfe: -494.084400 hartree
dipole: -4.4842 1.2464 -0.7025
dipole: 4.7069
quadrupole: -52.8834 -50.2061 -50.6391
quadrupole: 1.3471 -0.7518 -3.9439
quadrupole: -1.6405 1.0368 0.6038 1.3471 -0.7518 -3.9439
hfenergy: -494.2175054 hartree
pointgroup: C01 [X(C6H11N2O2)]
dipole: 1.7676152 -0.5462621 -0.0803304 debye
dipolederiv: -0.3465243 -0.2810587 0.0075936 0.4663332 -0.3172663 -0.0337189 -0.0372639 -0.175818 -0.1099097 -0.8847082 0.4092731 -0.0194922 0.3196068 -0.4320247 -0.0037723 -0.0137482 0.0133993 -0.2065546 -0.2075 0.0333507 -0.0314826 -0.219824 0.7083905 -0.0247985 0.1899746 0.0106899 -0.081789 0.2345166 0.1441885 0.0089459 0.2861883 -0.7946649 0.0609159 -0.0168406 0.3168223 -0.0263199 0.5830981 -0.0412434 0.0726446 -0.1014642 0.1892007 -0.0051686 -0.0441972 0.0113122 0.2407455 -0.0119789 0.0426068 -0.0474461 0.2006597 0.1000757 0.021285 -0.1430697 0.0264303 0.1006043 -0.168294 0.0051193 -0.0251603 0.0603564 0.0453636 0.0242579 0.1151519 0.0043714 -0.0230843 0.0075748 -0.0058629 0.0093035 -0.1392159 0.0472959 0.058335 0.1382623 0.0492029 0.0184587 -0.3463706 0.4005312 -0.023145 -0.0385298 -0.1852209 0.0042873 -0.0277684 0.0147379 -0.0101144 1.4915558 -0.6850633 0.0503908 -0.7902163 0.8028992 0.0302681 -0.0031886 -0.0227628 0.3212763 0.0240609 -0.0594729 -0.0267683 -0.0330541 -0.066814 -0.0602847 -0.0092603 -0.0693995 0.0392162 0.0055482 -0.0215093 -0.0843152 -0.054273 0.0597738 -0.0147506 -0.0758948 0.0026254 -0.0785089 0.0205961 0.0756142 0.0525405 0.0584398 -0.0649207 -0.0364015 0.0696172 -0.0749079 0.0378206 0.0596823 -0.0833396 0.0777496 -0.082535 0.0321689 0.0508351 0.0387532 0.0245044 0.0306794 0.1057701 0.0597144 0.000032 0.0444024 -0.0647604 -0.0406947 -0.015737 0.0158363 0.0674657 -0.0156417 0.0351519 -0.0092564 0.0136478 0.1239294 -0.0324977 -0.0593969 -0.0171645 0.1098433 0.055395 0.0110287 -0.049196 0.022822 0.0984799 -0.0411069 -0.1024688 -0.0394682 -0.0848973 0.0712464 -0.0100272 -0.0101017 0.0588711 -0.1064852 -0.064122 -0.019405 -0.0488022 0.1020078 0.0167341 -0.0317405 0.0485817 -0.0296447 0.0464444 0.086004 0.044876 0.0788331 0.0340745 0.1342186 -0.021273 -0.0210536 -0.0195846 0.2285824 0.0022098 -0.0481846 -0.0054495 0.2021588 0.1710206 0.0240121 0.0196349 -0.0229861 0.5495526 0.0189183 0.019789 -0.1149929 0.3168271 unknown
polarizability: 117.2343854|-8.7128696|84.6127932|2.3001091|1.6574532|59.5266754 unknown
InChI: InChI=1S/C6H11N2O2/c1-3-5(2)8-4-6(9)10-7-8/h4-5,7H,3H2,1-2H3
charge 1 multiplicity 1
21 atoms
O  -2.172272 -1.011454 -0.346242
O  -3.298807 1.12923 -0.149414
N  -0.062369 -0.223949 0.017903
N  -0.822825 -1.365892 -0.137349
C  1.448744 -0.349023 0.208867
C  2.163106 0.638931 -0.751264
C  1.772814 -0.160974 1.706126
C  3.686432 0.383453 -0.792825
C  -0.831308 0.862873 0.10101
C  -2.23802 0.535559 -0.118148
H  1.679133 -1.390343 -0.09424
H  1.74617 0.52786 -1.770549
H  1.973317 1.679664 -0.424761
H  1.192445 -0.849629 2.342842
H  1.590755 0.87744 2.033166
H  2.841377 -0.381712 1.860678
H  4.170821 0.578364 0.178797
H  3.920177 -0.652325 -1.099156
H  4.150262 1.057965 -1.531855
H  -0.439424 1.851544 0.32281
H  -0.478329 -2.139484 -0.728496
