program: Gaussian 09
title: 000103010
version: EM64L-G09RevD.01
frameworkgroup: C1[X(C6H10N2O2)]
method: RPBEPBE
basis: SDD
operation: Freq
keyword: #p
keyword: freq=noraman
keyword: PBEPBE/SDD
title: #p freq=noraman PBEPBE/SDD
converged: YES YES NO NO
title: Mulliken charges:
elementType: O O N N C C C C C C H H H H H H H H H H
charge: -0.212481 -0.206174 -0.021968 0.003421 -0.029445 -0.359922 -0.677485 -0.682154 -0.288731 0.146131 0.217613 0.238257 0.205676 0.220624 0.232982 0.247355 0.230054 0.205646 0.235694 0.294908
chargesum: 0.00000
title: Mulliken charges with hydrogens summed into heavy atoms:
elementType: O O N N C C C C C C
charge: -0.212481 -0.206174 -0.021968 0.003421 0.188167 0.084011 0.023475 -0.010759 0.006177 0.146131
polarizability: 1.11773971e+02 7.50188168e+00 6.66834645e+01 -5.67706738e+00 -3.55098514e+00 7.80624808e+01
1716.lowfreq: -19.7545 -11.5982 -6.5321 -0.0010 -0.0010 -0.0005 18.2045 64.3879 123.1057
frequency: 16.2576 64.1281 123.0536 183.0574 200.9323 204.0145 238.6150 257.3410 342.0806 397.5773 453.6528 478.1275 532.2998 599.5990 611.0670 642.1064 691.0032 735.5195 794.9151 837.4371 907.0801 962.8801 987.3806 1008.1902 1033.2599 1073.0224 1101.6904 1123.8241 1148.4997 1169.9001 1238.8248 1279.4236 1292.2608 1341.9653 1387.5997 1395.8983 1398.9103 1433.2567 1458.0336 1468.5732 1477.0757 1480.0183 1484.5462 1772.7090 2983.4127 2997.8093 3001.3649 3022.8456 3054.9350 3081.7900 3089.4463 3098.9450 3108.8394 3276.0077
redmass: 5.4706 2.6743 2.2154 2.1308 2.8133 1.1505 1.5056 4.3207 4.3266 4.2413 4.2946 5.3854 6.8322 2.9322 5.8597 1.5017 3.5881 6.5030 1.3273 2.0594 5.6331 1.3555 2.4285 1.9651 2.7302 2.2854 4.2296 2.4830 1.9265 2.3477 1.5178 1.4198 1.3214 1.5176 1.5478 1.2183 1.3885 3.4075 1.0738 1.0525 1.0519 1.0659 1.0478 12.0338 1.0368 1.0423 1.0541 1.0864 1.1000 1.1002 1.1000 1.1003 1.1009 1.0982
irintensity: 0.7191 2.2905 2.0410 1.0910 0.5765 0.1805 0.3053 1.1629 2.2602 7.8686 5.4691 2.6547 27.5078 1.5595 1.3365 31.5531 34.8263 18.8892 10.9326 1.0901 18.6589 5.9881 19.2191 4.4307 8.5687 16.4839 10.5608 3.5218 28.8106 9.5512 7.6498 3.0193 20.4954 1.5694 5.3758 20.7091 9.7502 9.5408 4.7658 21.7355 7.3051 14.5230 13.6087 546.0603 22.7385 3.5772 30.9339 9.3979 1.9661 37.7664 33.7957 29.5442 19.7403 6.4871
temp: 298.150 k
press: 1.00000 atm
elementType: 8 8 7 7 6 6 6 6 6 6 1 1 1 1 1 1 1 1 1 1
symmnumber: 1
zpe: 415959.5 jmol-1
zpe.correction: 0.158431 hartree
zpe.thermalcorrener: 0.168971 hartree
zpe.thermalcorrenthalpy: 0.169916 hartree
zpe.thermalcorrgfe: 0.121201 hartree
zpe.sumelectzpe: -493.739477 hartree
zpe.sumelectthermal: -493.728936 hartree
zpe.sumelectthermalent: -493.727992 hartree
zpe.sumelectthermalfe: -493.776707 hartree
dipole: -7.0612 -0.5862 -2.7918
dipole: 7.6157
quadrupole: -73.3217 -58.1479 -60.2662
quadrupole: -1.0268 -0.0960 1.4239
quadrupole: -9.4098 5.7640 3.6458 -1.0268 -0.0960 1.4239
hfenergy: -493.8979074 hartree
pointgroup: C01 [X(C6H10N2O2)]
dipole: 2.7789115 -0.1697439 1.1073854 debye
dipolederiv: -0.5822178 -0.0014943 -0.281112 0.1566256 -0.1777639 0.0285749 0.4855569 -0.0873307 -0.2457281 -1.4895108 0.2059202 0.2089817 0.2287732 -0.3553327 -0.0395508 0.1877805 -0.0324572 -0.3406439 -0.180376 -0.0334794 -0.3029303 -0.0929774 -0.0507448 0.112742 -0.4946712 0.1497505 0.2714023 0.046624 0.0572428 0.3752443 0.0736158 -0.1308005 -0.0908838 0.4749069 -0.0904582 -0.2390143 0.625595 -0.0431291 0.0428161 -0.0391348 0.2281611 -0.0045961 0.1299236 -0.0297798 0.226192 0.0790225 0.0352037 0.0140014 0.064832 0.0463244 0.0109728 -0.0055463 0.0161644 0.0569255 -0.0446065 -0.0111712 0.0016623 -0.0144218 -0.0796651 -0.0166232 -0.017673 -0.0089088 0.0375158 0.0309493 -0.0108005 0.016802 0.0065647 -0.0684914 0.0103105 0.0317444 0.0229667 0.0878099 -0.5717185 0.1137581 0.323231 -0.0040658 -0.249233 -0.0322471 -0.2900096 0.0458543 -0.1743112 2.0330493 -0.3185869 -0.3103385 -0.3643064 0.3197858 0.06943 -0.411281 0.0808652 0.3316457 -0.0125509 0.0206084 0.0532253 0.0128963 0.0353944 -0.0709547 -0.0001581 -0.0415606 -0.0930856 0.111937 -0.0199682 -0.0355399 -0.0165176 0.010826 -0.0644509 0.0030323 -0.047624 -0.075174 -0.1611038 0.0606557 -0.0467696 0.0343471 0.026895 0.0260306 -0.0602604 0.0311202 0.0777394 -0.1314494 0.0426405 -0.0733602 0.031719 0.0803064 -0.0026221 -0.0712275 0.0013792 0.0903769 0.0329217 -0.1005511 0.0844777 -0.0644086 -0.0330369 0.0507659 0.0787797 0.0769258 0.0326778 0.1218511 0.0034776 -0.0288386 -0.0001759 0.0759748 0.0063669 -0.002573 -0.0565065 -0.0736443 -0.0057419 -0.1094444 0.079042 -0.0967391 -0.0360671 0.0648622 0.0924995 0.087749 0.0403072 0.0929782 0.0170128 -0.0080655 0.0108916 0.0501059 -0.0158545 -0.0283881 -0.0842407 -0.1536371 -0.1062266 0.0793665 -0.0596766 0.053246 0.0733029 -0.0149195 -0.068344 -0.0057711 0.0587928 0.1105741 0.0127388 -0.0528526 0.0192361 0.2340587 -0.027353 -0.0340917 -0.0281376 0.0838533 unknown
polarizability: 111.8868865|-7.3871797|66.8546124|-5.4079909|3.9216842|77.7784174 unknown
InChI: InChI=1S/C6H10N2O2/c1-3-5(2)8-4-6(9)10-7-8/h4-5H,3H2,1-2H3
charge 0 multiplicity 1
20 atoms
O  -1.637551 -0.216722 -1.180635
O  -3.338265 0.379084 0.447552
N  0.109184 -0.246163 0.145805
N  -0.23433 -0.442919 -1.157641
C  1.554588 -0.419871 0.515922
C  2.435415 0.564888 -0.292357
C  1.965143 -1.893981 0.322296
C  2.089254 2.049259 -0.058143
C  -0.918632 0.086479 0.985258
C  -2.138909 0.141563 0.242316
H  1.60326 -0.153472 1.588344
H  2.348654 0.316265 -1.366141
H  3.484691 0.370543 0.0017
H  3.002704 -2.035084 0.671527
H  1.310192 -2.572168 0.896266
H  1.910835 -2.174502 -0.742916
H  2.774396 2.700113 -0.62911
H  2.178754 2.322625 1.010262
H  1.060347 2.281956 -0.385848
H  -0.779133 0.269908 2.044042
