program: Gaussian 09
title: 000103030
version: EM64L-G09RevD.01
frameworkgroup: C1[X(C16H22Cl2O4)]
method: RPBEPBE
basis: SDD
operation: Freq
keyword: #p
keyword: freq=noraman
keyword: PBEPBE/SDD
title: #p freq=noraman PBEPBE/SDD
converged: NO YES NO NO
title: Mulliken charges:
elementType: Cl Cl O O O O C C C C C C C C C C C C C C C C H H H H H H H H H H H H H H H H H H H H H H
charge: -0.049272 -0.049269 -0.258644 -0.258646 -0.217352 -0.217345 0.468856 0.468858 -0.114905 -0.114905 -0.594445 -0.529398 -0.523892 -0.523890 -0.529400 -0.455092 -0.641939 -0.641940 0.295372 0.295365 -0.502003 -0.502003 0.211787 0.211787 0.229446 0.229448 0.216606 0.262110 0.223904 0.207341 0.223898 0.207342 0.216608 0.262109 0.202982 0.202981 0.314757 0.314757 0.238399 0.242090 0.248523 0.248524 0.238399 0.242090
chargesum: 0.00000
title: Mulliken charges with hydrogens summed into heavy atoms:
elementType: Cl Cl O O O O C C C C C C C C C C C C C C C C
charge: -0.049272 -0.049269 -0.258644 -0.258646 -0.217352 -0.217345 0.468856 0.468858 0.096882 0.096882 -0.135551 -0.050682 -0.092647 -0.092650 -0.050682 -0.049129 -0.327182 -0.327182 0.295372 0.295365 0.227009 0.227009
polarizability: 2.30708334e+02 6.86907146e-04 1.78801669e+02 1.19895366e+01 -1.73753333e-04 1.74422593e+02
1716.lowfreq: -12.6867 -9.0141 -2.8884 -0.0016 -0.0015 -0.0013 18.3561 18.8522 41.0282
frequency: 18.2937 18.5732 41.0170 43.6941 64.5288 96.9996 99.4305 110.7318 117.2402 127.0970 141.4853 148.7490 188.1183 208.2311 217.4729 220.3180 224.8499 246.9311 267.9277 279.7361 311.0968 319.7809 336.5306 361.6069 398.8803 400.7034 406.6272 426.7124 431.9192 451.5967 572.7961 581.8663 641.3542 654.3954 658.9119 674.5774 693.4050 706.0000 734.7799 744.5895 760.3881 800.7624 835.5480 836.6115 861.0973 871.9698 880.8406 881.6935 884.5961 934.7766 957.0221 965.8959 966.4315 974.3140 985.0767 998.1784 1045.5681 1047.9120 1052.2659 1069.3031 1105.3962 1106.7171 1110.2458 1112.1091 1112.1265 1121.5923 1122.1896 1146.2107 1148.9903 1149.9624 1153.7036 1175.9963 1176.4265 1202.8390 1244.0015 1255.0869 1262.5219 1286.7032 1287.3147 1291.4932 1297.1897 1315.2286 1320.3038 1325.1022 1329.6023 1341.7289 1341.9629 1350.8058 1358.1723 1363.1159 1420.6101 1420.6537 1450.4885 1453.0789 1453.0800 1459.3181 1461.4437 1461.7823 1462.5053 1464.7891 1476.0530 1489.9869 1643.2891 1644.1961 2965.1612 2965.7665 2971.3328 2973.4182 2991.7054 2992.9787 3004.5433 3007.3821 3007.4232 3011.6003 3027.3613 3029.4039 3034.2698 3037.1107 3065.2441 3065.2796 3080.6166 3080.7312 3110.3905 3110.3926 3154.9224 3154.9308
redmass: 5.2994 4.9824 6.0657 8.7270 6.5731 1.4269 1.2486 2.2878 3.7186 5.3533 5.0358 4.9168 5.2085 5.3781 5.3849 3.6605 4.1776 3.3511 6.2706 5.5894 3.3043 4.8407 3.2768 2.8985 2.6683 4.8424 4.5952 1.8385 1.8165 1.9630 4.9578 6.1687 4.3329 5.3581 5.1802 5.6782 5.6494 5.1143 6.4664 7.1860 3.8298 3.2734 6.0054 2.7672 4.2770 2.2819 1.6858 2.4637 1.7645 3.5700 3.1079 2.2353 2.4796 2.8997 3.2274 2.4679 2.1489 1.9365 1.9952 2.0804 2.3638 2.8518 1.3647 1.2738 1.2723 1.0388 1.5501 1.6743 1.4498 1.5697 2.5425 1.2006 1.2837 1.1130 2.0383 1.7278 1.6352 1.7734 1.7382 1.4319 1.7444 1.6434 1.4296 1.6356 1.5638 1.5843 1.4714 1.4807 1.4491 1.5708 1.1812 1.1818 1.0815 1.0497 1.0497 1.0800 1.0612 1.0506 1.0802 1.0905 1.0870 1.0900 9.1808 9.1891 1.0597 1.0600 1.0591 1.0619 1.0707 1.0662 1.0761 1.0295 1.0296 1.0798 1.1024 1.1018 1.1025 1.1024 1.1004 1.1005 1.0868 1.0867 1.1046 1.1046 1.1050 1.1050
irintensity: 1.6975 3.3380 0.4357 0.8817 0.0348 0.1901 0.4222 0.3722 0.3324 2.3522 0.1562 1.2562 3.2093 10.2271 6.4380 7.6470 0.0818 2.3744 0.7156 2.5419 22.4410 0.5032 12.5746 0.0928 0.2329 0.1743 0.1483 0.3246 1.5530 4.6289 45.5220 38.7336 7.5031 16.1957 5.2844 15.2882 10.4583 0.5118 4.3602 4.0885 2.8543 1.6047 0.3725 3.8472 11.5344 9.1309 0.3181 10.5479 2.5085 12.6682 0.0806 6.8774 11.9680 23.4768 0.3275 7.7981 24.4088 0.2006 4.5494 96.5940 365.9243 14.2839 67.5866 0.1747 2.3062 0.3891 23.4361 1.4325 36.1633 1.1598 1.7094 1.2251 10.6910 7.2981 15.8676 30.1447 0.1182 0.1703 18.9943 0.3000 9.0466 19.8699 3.5801 3.7974 68.8196 14.9950 13.4327 0.1213 5.8599 0.6321 22.1372 7.2922 0.1892 16.9548 15.4454 0.0143 1.9743 9.4887 25.9387 18.2678 23.7489 0.0258 106.7307 170.8631 0.0385 57.8693 17.0959 25.6402 14.0674 28.0653 113.7968 57.6813 1.4717 38.0747 6.1974 24.8810 27.8842 51.5675 17.2952 12.9295 1.2926 6.4665 21.4740 22.0758 17.4094 10.5804
temp: 298.150 k
press: 1.00000 atm
elementType: 17 17 8 8 8 8 6 6 6 6 6 6 6 6 6 6 6 6 6 6 6 6 1 1 1 1 1 1 1 1 1 1 1 1 1 1 1 1 1 1 1 1 1 1
symmnumber: 1
zpe: 936184.9 jmol-1
zpe.correction: 0.356574 hartree
zpe.thermalcorrener: 0.378843 hartree
zpe.thermalcorrenthalpy: 0.379787 hartree
zpe.thermalcorrgfe: 0.303060 hartree
zpe.sumelectzpe: -1842.236287 hartree
zpe.sumelectthermal: -1842.214018 hartree
zpe.sumelectthermalent: -1842.213074 hartree
zpe.sumelectthermalfe: -1842.289801 hartree
dipole: 0.0000 1.2581 0.0000
dipole: 1.2581
quadrupole: -121.1045 -150.8348 -145.7863
quadrupole: 0.0008 23.3590 0.0003
quadrupole: 18.1373 -11.5929 -6.5445 0.0008 23.3590 0.0003
hfenergy: -1842.592861 hartree
pointgroup: C01 [X(C16H22Cl2O4)]
dipole: -0.0000141 -0.4949744 0.0000192 debye
polarizability: 232.0016631|0.0002795|178.8016694|-8.3234784|0.0002238|173.1292633 unknown
InChI: InChI=1S/C16H22Cl2O4/c1-21-13(19)11(17)15-4-9-3-10(5-15)7-16(6-9,8-15)12(18)14(20)22-2/h9-12H,3-8H2,1-2H3
charge 0 multiplicity 1
44 atoms
Cl 2.498442 2.136528 1.790372
Cl -2.498356 2.136613 -1.790303
O  4.729325 0.953101 -0.630456
O  -4.729306 0.953088 0.630451
O  4.209182 -0.67781 0.948277
O  -4.209178 -0.677648 -0.948469
C  1.272272 0.090691 0.176081
C  -1.272252 0.09071 -0.176048
C  -0.161411 -1.703893 1.253132
C  0.161402 -1.703894 -1.253101
C  0.000017 0.971882 0.000018
C  1.096906 -0.815691 1.427458
C  1.423495 -0.815103 -1.093217
C  -1.423491 -0.815084 1.093246
C  -1.096901 -0.815672 -1.427426
C  -0.00001 -2.603656 0.000015
C  2.510727 1.008825 0.234895
C  -2.510695 1.008861 -0.234867
C  3.869763 0.311539 0.263562
C  -3.869729 0.311576 -0.26359
C  6.113013 0.417551 -0.685567
C  -6.113015 0.417581 0.685458
H  -0.282777 -2.336346 2.154184
H  0.282758 -2.336348 -2.154153
H  -0.114251 1.627943 0.885589
H  0.114295 1.627946 -0.885548
H  0.997504 -0.180457 2.328502
H  1.9947 -1.44277 1.56918
H  2.320127 -1.457391 -0.993514
H  1.558011 -0.18521 -1.996436
H  -2.320132 -1.457359 0.993539
H  -1.558003 -0.185191 1.996466
H  -0.99749 -0.18044 -2.32847
H  -1.994704 -1.442738 -1.569148
H  0.885407 -3.258831 0.118196
H  -0.885436 -3.258819 -0.118166
H  2.50196 1.735965 -0.592322
H  -2.501947 1.73597 0.592377
H  6.628258 1.049646 -1.421461
H  6.100513 -0.638461 -1.003372
H  6.585072 0.492746 0.308128
H  -6.585037 0.492896 -0.308246
H  -6.628264 1.049617 1.421399
H  -6.100563 -0.638465 1.003152
