program: Gaussian 09
title: 000103018
version: EM64L-G09RevD.01
frameworkgroup: C1[X(C14H20O2)]
method: RPBEPBE
basis: SDD
operation: Freq
keyword: #pfreq=noraman
keyword: PBEPBE/SDD
title: #p freq=noraman PBEPBE/SDD
converged: YES YES NO NO
title: Mulliken charges:
elementType: O O C C C C C C C C C C C C C C H H H H H H H H H H H H H H H H H H H H
charge: -0.276364 -0.245095 -0.374649 -0.346089 -0.508668 -0.345637 -0.168611 0.269445 0.511584 -0.697842 -0.714394 -0.382419 -0.424062 -0.233741 -0.219635 -0.241129 0.215186 0.201819 0.189456 0.219443 0.228968 0.228024 0.189914 0.191367 0.245146 0.218290 0.209930 0.212055 0.226677 0.225355 0.231803 0.236743 0.243655 0.225770 0.227944 0.229764
chargesum: 0.00000
title: Mulliken charges with hydrogens summed into heavy atoms:
elementType: O O C C C C C C C C C C C C C C
charge: -0.276364 -0.245095 0.042356 0.062811 -0.051677 0.035643 0.076535 0.269445 0.511584 -0.057567 -0.030559 -0.145676 -0.180407 -0.007971 0.008308 -0.011366
polarizability: 1.37198713e+02 -2.84810089e+00 1.71212758e+02 -1.01935072e+01 2.39773999e+00 1.40786321e+02
1716.lowfreq: -11.6952 -0.0006 0.0004 0.0006 2.8782 7.7422 9.1993 16.8091 30.3836
frequency: 4.9079 16.7449 30.3329 44.4855 65.6162 75.9955 113.7613 142.6155 152.3466 182.0679 200.8159 218.5105 233.1644 251.5706 287.7085 312.7546 372.8216 384.1206 402.4167 428.4475 471.7327 530.5942 584.1408 602.3096 616.9461 659.9957 703.0598 730.4357 762.1421 775.9574 784.6947 794.0556 848.1854 853.5272 870.1332 915.2246 924.1273 934.1880 977.2498 986.6295 990.9297 995.2678 998.7602 1025.5211 1033.7940 1054.7552 1064.8744 1074.0218 1097.1245 1106.9763 1129.6321 1172.9199 1173.5110 1188.0315 1211.7472 1216.3166 1221.6256 1271.6367 1278.7311 1293.8629 1298.9876 1300.1531 1315.7524 1335.1663 1351.4496 1360.1935 1389.2740 1389.6779 1393.2855 1445.2319 1446.0693 1460.6034 1462.8161 1466.1835 1472.0226 1476.4965 1476.6891 1484.6735 1487.2469 1595.3114 1613.4941 1635.0399 2958.7419 2966.1959 2971.1023 2982.7173 2995.6305 2998.9397 3006.9832 3022.5158 3034.7414 3049.4986 3068.3397 3069.9395 3083.4220 3095.3624 3100.2669 3121.8515 3128.3113 3138.9677 3149.0372 3164.5555
redmass: 3.6107 4.2604 3.6663 6.7959 2.4471 2.3062 2.8094 3.8083 2.4427 2.9026 2.8013 1.2293 1.1419 2.9111 2.7743 4.1027 3.4259 2.6179 2.7976 3.8845 3.5331 3.4597 3.9873 4.4057 6.2892 2.5187 1.6807 1.1254 2.4761 2.6240 2.3465 1.6392 2.0008 1.2638 2.8459 1.8642 1.4333 1.6428 1.4022 3.1633 2.1623 1.6875 1.9190 2.1933 2.0870 1.8349 2.0766 1.7634 2.0510 2.1258 2.2174 1.0549 2.0860 1.1144 1.4803 1.8685 1.8483 1.2641 1.2322 1.1100 1.3612 1.5265 1.2939 1.4349 1.4849 1.5880 1.2185 3.9679 1.2833 2.0458 1.0998 1.0760 1.0766 1.0732 1.0582 1.0479 1.0666 2.1729 1.0828 6.0277 6.1009 10.5036 1.0585 1.0599 1.0363 1.0615 1.0355 1.0972 1.0613 1.1016 1.0864 1.1035 1.1007 1.0995 1.1008 1.0993 1.1004 1.0848 1.0874 1.0922 1.0966 1.1016
irintensity: 0.1040 0.1772 0.0501 0.8794 1.0196 0.8249 0.3906 0.7504 2.3817 1.1699 0.2085 0.9040 0.0956 3.9565 0.4587 3.1714 3.1683 0.1806 0.2097 4.1252 1.1800 26.5504 2.2537 10.1819 0.8843 4.3282 66.0601 6.8327 20.1565 21.6495 7.0234 1.5751 4.2782 0.1295 28.1663 8.1669 2.9368 84.5713 0.3313 18.1378 4.6477 8.7936 8.5045 38.2824 81.0713 37.3919 11.7891 8.3244 23.8914 5.8464 0.8194 0.1724 66.4084 0.5914 41.8455 29.9989 58.7180 9.8501 5.5930 0.0513 7.8096 11.2128 1.4472 5.0212 4.6680 1.6741 11.6430 2.1133 17.2065 7.8409 15.8576 4.6277 9.3324 0.4444 9.5524 9.2235 5.0334 8.1040 12.2381 2.1206 0.3913 154.7386 4.8839 36.0704 32.5575 56.9143 17.9599 2.3677 25.4829 13.6767 8.9027 41.3809 81.9134 58.7827 34.5049 22.0938 31.3225 2.0795 0.0193 16.9592 35.0580 17.6718
temp: 298.150 k
press: 1.00000 atm
elementType: 8 8 6 6 6 6 6 6 6 6 6 6 6 6 6 6 1 1 1 1 1 1 1 1 1 1 1 1 1 1 1 1 1 1 1 1
symmnumber: 1
zpe: 805143.7 jmol-1
zpe.correction: 0.306663 hartree
zpe.thermalcorrener: 0.324063 hartree
zpe.thermalcorrenthalpy: 0.325007 hartree
zpe.thermalcorrgfe: 0.257101 hartree
zpe.sumelectzpe: -694.722198 hartree
zpe.sumelectthermal: -694.704799 hartree
zpe.sumelectthermalent: -694.703855 hartree
zpe.sumelectthermalfe: -694.771760 hartree
dipole: -0.0550 0.5727 -1.8878
dipole: 1.9735
quadrupole: -91.8450 -91.8700 -99.5081
quadrupole: -1.2621 -1.7753 3.7129
quadrupole: 2.5627 2.5377 -5.1004 -1.2621 -1.7753 3.7129
hfenergy: -695.0288615 hartree
pointgroup: C01 [X(C14H20O2)]
dipole: 0.0082718 0.1731922 -0.7568429 debye
polarizability: 137.5958942|-2.2722003|171.6188647|-10.0444821|0.5463373|139.983033 unknown
InChI: InChI=1S/C14H20O2/c1-3-4-6-11-14(15)16-12(2)13-9-7-5-8-10-13/h5,7-10,12H,3-4,6,11H2,1-2H3
charge 0 multiplicity 1
36 atoms
O  -0.260758 -1.947063 -0.339006
O  0.024845 -1.848916 1.977505
C  2.65064 -1.395147 -0.369985
C  2.721659 0.004528 0.28003
C  1.929489 -2.450768 0.513143
C  3.472819 1.032358 -0.596288
C  -1.67645 -1.431865 -0.18385
C  0.497215 -2.057562 0.83618
C  -1.651449 0.090212 -0.137226
C  3.508361 2.44135 0.034017
C  -2.447324 -2.023536 -1.367343
C  -1.167125 0.845223 -1.236809
C  -2.111378 0.771369 1.015652
C  -1.15134 2.255611 -1.184999
C  -2.105386 2.184098 1.066372
C  -1.625495 2.930039 -0.034113
H  2.127379 -1.326536 -1.342694
H  3.676064 -1.760987 -0.577803
H  3.216996 -0.068826 1.270486
H  1.6953 0.378198 0.472039
H  1.917858 -3.423236 -0.014795
H  2.456965 -2.582416 1.473489
H  4.508395 0.676454 -0.775365
H  2.984519 1.084408 -1.591199
H  -2.060299 -1.82383 0.775469
H  2.483234 2.827869 0.18863
H  4.010813 2.422076 1.019636
H  4.050259 3.160249 -0.608019
H  -2.023486 -1.687783 -2.329278
H  -3.50308 -1.701906 -1.325634
H  -2.411152 -3.125975 -1.337436
H  -0.789696 0.327171 -2.12617
H  -2.457352 0.193126 1.880169
H  -0.771562 2.829953 -2.037676
H  -2.463538 2.699371 1.96454
H  -1.61564 4.025187 0.004833
