program: Gaussian 09
title: 000103014
version: EM64L-G09RevD.01
frameworkgroup: C1[X(C15H14O4)]
method: RPBEPBE
basis: SDD
operation: Freq
keyword: #pfreq=noraman
keyword: PBEPBE/SDD
title: #p freq=noraman PBEPBE/SDD
converged: YES YES NO NO
title: Mulliken charges:
elementType: O O O O C C C C C C C C C C C C C C C H H H H H H H H H H H H H H
charge: -0.281849 -0.220151 -0.422946 -0.206651 0.197116 0.094836 0.287051 0.179140 0.434549 -0.576377 -0.250351 0.226146 -0.364512 -0.367775 -0.791072 -0.419284 -0.690563 -0.478861 0.167196 0.250410 0.228222 0.257397 0.235336 0.233705 0.242489 0.238300 0.244167 0.245035 0.228918 0.224683 0.244263 0.267099 0.344335
chargesum: 0.00000
title: Mulliken charges with hydrogens summed into heavy atoms:
elementType: O O O O C C C C C C C C C C C C C C C
charge: -0.281849 -0.220151 -0.078611 -0.206651 0.197116 0.094836 0.287051 0.179140 0.434549 -0.325967 -0.022129 0.226146 -0.107116 -0.132439 -0.076578 0.069918 0.007301 -0.211762 0.167196
polarizability: 3.26977494e+02 -1.45980389e+01 1.67340700e+02 7.11187569e-01 -2.11546422e+00 9.16121924e+01
1716.lowfreq: -3.9390 -0.0004 0.0007 0.0007 2.3256 8.9907 30.2106 33.2699 51.1839
frequency: 30.1487 33.2607 51.1673 79.5992 91.1785 117.2403 148.0248 149.0763 174.6835 206.2506 213.6589 231.8138 234.5690 255.8096 306.5935 335.1781 341.4513 368.9509 397.1516 441.4402 459.7927 495.0798 507.6134 518.9532 573.2860 590.6002 623.8481 653.7376 664.1927 676.5374 693.2725 730.9951 754.0437 801.1818 808.4381 823.2997 834.3937 853.4500 866.0589 895.3482 909.1189 956.6645 958.5068 970.4954 993.5976 1008.0394 1026.0548 1041.1051 1043.4072 1063.4054 1087.8972 1108.4425 1127.3030 1146.0593 1180.9557 1227.9653 1238.1865 1250.4039 1276.9248 1284.2780 1304.2988 1318.3300 1358.3246 1376.2065 1385.7691 1401.2387 1411.0141 1446.0703 1457.4384 1464.4796 1467.1401 1468.4076 1471.8807 1476.5743 1594.2576 1615.3331 1616.5412 1631.2156 1699.8194 2978.8875 2990.4640 2998.1748 3052.9037 3053.1255 3061.5785 3089.3137 3093.9974 3104.6207 3142.5651 3154.0170 3178.1619 3219.0912 3547.9875
redmass: 5.2834 4.5108 3.9902 5.7667 5.9774 1.0662 3.7482 3.2634 5.1992 3.8018 3.2931 2.2644 1.5304 3.2821 2.8222 2.0321 2.2229 5.3506 3.5631 3.3241 3.8206 3.1879 5.4280 4.6993 4.8997 3.7944 3.0325 7.4819 5.6897 5.7997 6.5923 5.6643 4.0800 5.0275 5.7450 1.4560 6.2713 3.4445 1.5295 1.5600 3.2736 5.8456 1.3554 1.8633 1.8217 3.0309 2.3828 1.5779 1.5273 3.2568 2.5915 3.4858 1.6172 1.0728 2.2623 1.6653 2.5096 1.5757 1.7437 1.5601 1.7236 1.7514 2.1518 1.6028 1.2186 3.2446 1.6458 1.4532 2.0717 1.4182 1.5329 1.0498 1.0860 1.2113 7.0552 7.9156 7.7048 7.5341 12.2342 1.0383 1.0355 1.0570 1.0985 1.1057 1.0871 1.0981 1.0972 1.1007 1.0918 1.0885 1.0972 1.0975 1.0661
irintensity: 1.5891 0.8612 2.6018 2.3815 2.8511 0.0283 1.0920 0.1374 3.4693 2.8437 4.4202 2.0449 2.9782 2.4639 33.9278 81.8974 83.4494 8.4958 19.7922 13.8395 8.2655 3.3923 6.0415 3.3934 5.5742 1.6720 5.0601 5.9653 2.5224 3.8208 7.8582 5.2031 0.2950 38.3073 34.0892 45.8022 6.4750 56.1386 51.4436 7.0878 6.4818 11.8205 0.2480 61.1803 2.4369 42.8569 89.1816 51.6223 3.9631 12.7631 2.1440 126.6086 8.3395 0.5648 18.8007 9.0322 12.9792 32.4792 75.6758 9.8127 1.5596 27.7995 56.7928 18.4378 21.4704 4.3969 13.9892 24.1753 3.3883 23.2601 22.6563 14.5193 9.3979 11.6198 27.1086 119.1132 21.9383 12.2392 642.8348 26.6341 15.5189 23.1938 10.0629 15.4969 5.4917 30.4598 16.8068 32.7578 7.3488 2.0638 4.2650 4.7178 15.3976
temp: 298.150 k
press: 1.00000 atm
elementType: 8 8 8 8 6 6 6 6 6 6 6 6 6 6 6 6 6 6 6 1 1 1 1 1 1 1 1 1 1 1 1 1 1
symmnumber: 1
zpe: 667273.4 jmol-1
zpe.correction: 0.254151 hartree
zpe.thermalcorrener: 0.271600 hartree
zpe.thermalcorrenthalpy: 0.272544 hartree
zpe.thermalcorrgfe: 0.207849 hartree
zpe.sumelectzpe: -879.517883 hartree
zpe.sumelectthermal: -879.500434 hartree
zpe.sumelectthermalent: -879.499490 hartree
zpe.sumelectthermalfe: -879.564185 hartree
dipole: -6.6882 0.0968 -1.3451
dipole: 6.8228
quadrupole: -167.7100 -96.9969 -113.7332
quadrupole: -0.7275 8.0533 -2.8761
quadrupole: -41.5633 29.1498 12.4135 -0.7275 8.0533 -2.8761
hfenergy: -879.772034 hartree
pointgroup: C01 [X(C15H14O4)]
dipole: -2.6263218 0.1794657 -0.5250704 debye
polarizability: 326.5489116|-16.8102797|165.6371656|-0.7815351|12.6866565|93.7443099 unknown
InChI: InChI=1S/C15H14O4/c1-8-12-5-10(11-6-14(17)18-7-11)3-4-13(12)19-15(8)9(2)16/h3-6,9,16H,7H2,1-2H3
charge 0 multiplicity 1
33 atoms
O  -2.770914 -1.010825 -0.288064
O  4.796975 1.265784 0.22159
O  -5.298033 -0.173017 1.219834
O  6.315212 -0.499755 -0.087902
C  -0.978129 0.422981 -0.00038
C  -2.20452 1.206712 0.129714
C  -3.254123 0.323396 -0.049624
C  -1.37293 -0.922784 -0.249457
C  1.350904 -0.314534 -0.103137
C  0.398798 0.726951 0.072694
C  -4.749246 0.445714 -0.014089
C  2.788229 -0.017665 -0.03273
C  -0.466459 -1.97876 -0.426004
C  0.900132 -1.654638 -0.350253
C  -2.28057 2.682312 0.414546
C  3.32754 1.384716 0.230261
C  -5.435458 -0.124512 -1.271582
C  3.86307 -0.856346 -0.175776
C  5.13502 -0.116316 -0.028382
H  0.725004 1.755038 0.264116
H  -5.005742 1.511482 0.105072
H  -0.806179 -3.000507 -0.61436
H  1.638977 -2.450628 -0.483838
H  -3.322899 3.032507 0.493974
H  -1.774795 2.927454 1.367272
H  -1.786515 3.270867 -0.381471
H  3.036068 2.105122 -0.556568
H  3.020114 1.777918 1.217171
H  -5.172991 -1.18746 -1.417161
H  -5.12511 0.428672 -2.176567
H  -6.529507 -0.03749 -1.161206
H  3.863244 -1.927442 -0.372928
H  -5.079669 -1.141046 1.200835
