program: Gaussian 09
title: 000103009
version: EM64L-G09RevD.01
frameworkgroup: C1[X(C10H17NO)]
method: RPBEPBE
basis: SDD
operation: Freq
keyword: #p
keyword: freq=noraman
keyword: PBEPBE/SDD
title: #p freq=noraman PBEPBE/SDD
converged: YES YES NO NO
title: Mulliken charges:
elementType: O N C C C C C C C C C C H H H H H H H H H H H H H H H H H
charge: -0.203912 -0.097410 -0.121507 -0.122133 -0.463158 -0.462666 -0.544261 -0.544320 0.006003 0.178751 -0.715455 -0.714659 0.237989 0.238149 0.213725 0.232747 0.232732 0.213664 0.223805 0.247832 0.247834 0.223947 0.177447 0.214050 0.225953 0.217653 0.217462 0.213749 0.225988
chargesum: 0.00000
title: Mulliken charges with hydrogens summed into heavy atoms:
elementType: O N C C C C C C C C C C
charge: -0.203912 -0.097410 0.116482 0.116017 -0.016686 -0.016270 -0.072624 -0.072539 0.183450 0.178751 -0.057799 -0.057460
polarizability: 1.29865904e+02 1.93873335e+00 1.00754484e+02 5.91833933e-01 -1.48852195e+00 1.05087687e+02
1716.lowfreq: -13.0983 -0.0005 -0.0005 -0.0003 5.5118 17.1832 50.2852 66.7010 119.5984
frequency: 49.5950 66.5481 119.5508 134.5671 175.1930 222.9643 233.0188 311.4672 311.8710 361.8109 396.1788 412.6222 453.8842 463.8478 483.4995 508.3059 576.0351 678.1154 730.2957 745.3115 791.9452 811.8370 840.8839 858.4741 876.1756 907.2805 916.0355 941.0729 949.8826 975.2116 1008.0818 1008.6319 1033.9729 1064.2716 1084.3670 1141.9849 1147.1927 1151.8441 1155.5732 1171.8172 1191.2020 1196.6122 1224.5010 1228.6102 1241.0236 1264.7495 1266.5486 1299.6659 1321.8261 1324.2314 1326.9936 1335.0149 1347.8895 1375.4782 1392.2843 1432.1734 1443.0861 1462.0170 1465.4529 1472.9706 1477.2170 1483.2019 1494.5651 1619.1777 2830.7659 2969.0949 2972.6583 2982.2145 2985.2425 3014.4209 3027.2336 3052.0433 3058.4857 3064.6433 3068.1361 3071.3149 3077.9774 3082.4505 3084.0749 3090.7699 3094.3593
redmass: 2.6411 6.3278 2.1189 3.2732 1.7285 1.3501 1.2331 2.2653 2.2326 2.6538 2.3706 3.0319 2.3564 4.3628 2.9056 2.7767 3.3521 2.7445 4.2556 4.3724 1.5659 2.5050 1.9213 2.7111 2.3585 2.4786 1.1644 2.7384 1.4475 1.8203 2.2222 2.2218 2.0601 1.8971 2.0988 1.5014 1.6752 2.0459 1.2533 1.4536 2.8495 1.5425 1.6987 1.3005 1.3551 1.5752 1.4294 1.4167 1.4478 1.4989 1.3970 1.6700 1.4500 1.2281 1.2084 1.0905 1.0913 1.0516 1.0823 1.0440 1.0580 1.0952 1.0481 9.1685 1.0803 1.0641 1.0643 1.0351 1.0358 1.0591 1.0629 1.0890 1.0928 1.0951 1.0945 1.1038 1.0988 1.0984 1.1005 1.0997 1.1049
irintensity: 0.0620 4.4731 0.8419 1.1869 0.0593 0.3058 0.2007 0.9125 1.0963 3.2511 1.6483 0.5190 1.5331 5.8866 0.3329 10.6801 0.0129 27.3805 3.9885 8.7852 3.3870 1.8339 0.8357 0.1314 7.6169 20.8283 3.1812 20.9074 0.1719 0.0137 10.8771 10.1989 23.1054 0.0249 3.4965 8.5019 16.6982 0.0135 8.9217 47.5117 50.4581 2.7214 36.9692 1.1553 4.3365 59.0525 0.2281 0.9532 14.7998 3.1286 36.6327 30.0580 2.0783 23.4471 20.6602 17.8380 23.8688 8.2927 4.8031 1.6741 6.2885 11.1338 17.0315 210.6858 74.6383 7.8128 29.1474 29.3012 18.0786 19.5191 49.1200 33.3854 23.4548 38.0754 10.0390 0.1561 40.6842 54.0392 1.9412 51.2955 49.6973
temp: 298.150 k
press: 1.00000 atm
elementType: 8 7 6 6 6 6 6 6 6 6 6 6 1 1 1 1 1 1 1 1 1 1 1 1 1 1 1 1 1
symmnumber: 1
zpe: 666820.0 jmol-1
zpe.correction: 0.253978 hartree
zpe.thermalcorrener: 0.265752 hartree
zpe.thermalcorrenthalpy: 0.266696 hartree
zpe.thermalcorrgfe: 0.216510 hartree
zpe.sumelectzpe: -520.272221 hartree
zpe.sumelectthermal: -520.260448 hartree
zpe.sumelectthermalent: -520.259504 hartree
zpe.sumelectthermalfe: -520.309690 hartree
dipole: 3.3955 0.7735 0.2401
dipole: 3.4908
quadrupole: -86.2629 -74.7862 -70.3480
quadrupole: -8.1988 -2.5143 -1.5048
quadrupole: -9.1305 2.3462 6.7843 -8.1988 -2.5143 -1.5048
hfenergy: -520.5261998 hartree
pointgroup: C01 [X(C10H17N1O1)]
dipole: 1.3603667 -0.1885685 -0.004316 debye
polarizability: 129.9803753|0.8426825|100.1803182|0.0208966|-0.1126298|105.5473808 unknown
InChI: InChI=1S/C10H17NO/c1-7(2)11-8-3-4-9(11)6-10(12)5-8/h7-9H,3-6H2,1-2H3
charge 0 multiplicity 1
29 atoms
O  -3.05747 1.03202 0.019049
N  0.869947 -0.461848 -0.007418
C  -0.053311 -0.622517 1.152923
C  -0.053138 -0.582047 -1.172585
C  -0.853716 -1.893239 0.752436
C  -0.85329 -1.86625 -0.816837
C  -1.009396 0.622337 1.299649
C  -1.010371 0.666478 -1.276648
C  1.855407 0.653252 0.013204
C  -1.812096 0.821864 0.014873
C  2.735463 0.610181 -1.255922
C  2.74151 0.555277 1.274882
H  0.510379 -0.762742 2.089463
H  0.510461 -0.689821 -2.113433
H  -1.873639 -1.879642 1.174425
H  -0.342215 -2.796206 1.125444
H  -0.34118 -2.75554 -1.220524
H  -1.873012 -1.83832 -1.238601
H  -0.389286 1.52313 1.488954
H  -1.705379 0.504752 2.148859
H  -1.70705 0.577247 -2.128736
H  -0.391143 1.573763 -1.435875
H  1.34549 1.651655 0.0361
H  3.515517 1.390443 -1.199696
H  3.227651 -0.375509 -1.341621
H  2.152946 0.789299 -2.177233
H  2.163437 0.693942 2.20595
H  3.521544 1.337182 1.248928
H  3.23364 -0.433339 1.31509
