program: Gaussian 09
title: 000103004
version: EM64L-G09RevD.01
frameworkgroup: C1[X(C8H16)]
method: RPBEPBE
basis: SDD
operation: Freq
keyword: #p
keyword: freq=noraman
keyword: PBEPBE/SDD
title: #p freq=noraman PBEPBE/SDD
converged: YES YES NO NO
title: Mulliken charges:
elementType: C C C C C C C C H H H H H H H H H H H H H H H H
charge: -0.153572 -0.377654 0.575847 -0.716519 -0.551089 -0.692827 -0.675717 -0.769258 0.185460 0.190142 0.193589 0.210996 0.216139 0.219293 0.213036 0.201462 0.232111 0.209662 0.202888 0.211136 0.224527 0.217139 0.218110 0.215098
chargesum: 0.00000
title: Mulliken charges with hydrogens summed into heavy atoms:
elementType: C C C C C C C C
charge: 0.031889 0.006077 0.575847 -0.070091 -0.136591 -0.048166 -0.022915 -0.336050
polarizability: 8.90877586e+01 7.33036825e-01 7.92174201e+01 1.38338054e+00 -2.73505743e+00 8.90236186e+01
1716.lowfreq: -17.7437 -16.3709 -7.6272 -0.0008 0.0007 0.0008 36.9051 71.4925 116.4385
frequency: 35.3972 71.3195 116.4129 173.6561 187.5245 210.2503 214.5053 253.5733 263.6409 321.9286 403.6643 426.2973 484.9278 642.0716 693.9413 713.4004 788.5069 808.2005 840.1173 903.1618 925.7744 954.9294 1002.7705 1006.7366 1027.4609 1046.7617 1066.2561 1100.1756 1107.9411 1161.3929 1223.7744 1248.7645 1266.0299 1276.7541 1306.1814 1333.8149 1358.7904 1381.2839 1384.2823 1386.8862 1425.3208 1464.8471 1470.1954 1471.8097 1473.0224 1476.7169 1480.3882 1484.8578 1491.1112 1660.3567 2952.4252 2969.1693 2971.4414 2973.4925 2976.0243 2979.8007 3019.9058 3033.0070 3065.8031 3068.8838 3074.4113 3075.6435 3081.5397 3084.1793 3087.3047 3184.2531
redmass: 3.0140 1.9900 2.1325 2.6944 1.2153 1.0831 1.1540 2.1785 2.0014 2.2759 2.1086 2.8047 2.3346 3.1173 1.6302 1.2239 1.1617 1.3143 1.9633 1.6882 1.3655 1.2401 1.7385 1.6847 2.6295 1.7494 1.7046 2.2069 1.6888 2.1564 1.6853 1.2109 1.3416 1.2658 1.4037 1.4849 1.6325 1.2055 1.1984 1.2259 1.1595 1.0626 1.0601 1.0459 1.0474 1.0461 1.0665 1.0790 1.0649 5.0135 1.0819 1.0593 1.0470 1.0401 1.0465 1.0357 1.1000 1.0985 1.0994 1.0995 1.0995 1.0999 1.0996 1.1009 1.0623 1.1132
irintensity: 0.0390 0.0240 0.0164 0.3082 0.0735 0.0486 0.2612 0.2865 0.2160 0.1101 0.5333 0.6059 1.5762 10.5015 0.6677 2.0137 9.7731 0.7912 2.2223 0.8928 70.6507 9.8481 3.3537 11.7319 2.3853 2.9397 5.5806 7.2408 1.7779 0.6973 0.4282 0.0034 1.6928 3.7217 0.4390 0.3291 0.8297 1.3580 3.0706 36.6541 5.8493 1.0273 5.7968 0.5129 13.4722 26.1662 1.9753 31.1918 2.3530 22.7085 16.9533 21.9945 16.6749 91.8665 22.3012 35.4706 21.4910 16.6712 50.5711 33.7007 73.7642 27.9857 38.0800 64.0468 8.3353 27.0839
temp: 298.150 k
press: 1.00000 atm
elementType: 6 6 6 6 6 6 6 6 1 1 1 1 1 1 1 1 1 1 1 1 1 1 1 1
symmnumber: 1
zpe: 571905.7 jmol-1
zpe.correction: 0.217827 hartree
zpe.thermalcorrener: 0.228582 hartree
zpe.thermalcorrenthalpy: 0.229526 hartree
zpe.thermalcorrgfe: 0.181789 hartree
zpe.sumelectzpe: -313.757669 hartree
zpe.sumelectthermal: -313.746914 hartree
zpe.sumelectthermalent: -313.745970 hartree
zpe.sumelectthermalfe: -313.793707 hartree
dipole: -0.1022 0.1112 -0.5931
dipole: 0.6120
quadrupole: -50.8116 -54.7629 -52.1970
quadrupole: 0.0495 0.1348 -0.7573
quadrupole: 1.7789 -2.1724 0.3935 0.0495 0.1348 -0.7573
hfenergy: -313.975496 hartree
pointgroup: C01 [X(C8H16)]
dipole: -0.0333944 -0.0569628 0.2315449 debye
dipolederiv: 0.0132026 0.0401685 0.0134603 0.0495769 0.0408212 0.1161127 -0.0238697 0.0149165 0.1378133 0.0796463 0.0000468 0.0295037 0.0080415 0.0450255 0.009849 0.003555 0.024297 0.1236486 0.2808449 -0.0956407 -0.0236523 -0.0206637 -0.1475167 -0.125074 0.0178091 -0.092208 0.2470818 0.0311752 -0.0111941 -0.0382784 -0.0303414 -0.0364888 -0.0375613 -0.0167124 0.0295683 0.0558248 0.0103168 0.0240134 0.0319643 0.0435509 0.121514 -0.0680433 0.0641732 -0.0266053 0.0436194 0.0376091 -0.02797 -0.0282872 -0.0053404 -0.0835133 0.0034057 -0.013041 -0.0011508 0.083587 0.0292781 0.0213616 0.0553865 -0.0104072 0.0131444 -0.0119025 0.0199189 -0.0464952 0.0426267 -0.0210156 0.0497472 0.0482353 -0.0166664 -0.4259684 -0.0481853 0.0243596 -0.0422414 -0.275249 0.0183203 0.0120906 0.0515718 0.0097803 0.00942 -0.0814589 0.0769428 -0.0589363 -0.1507775 0.0616037 0.0033475 0.0475442 0.0010268 0.0015356 -0.0687549 0.1107511 -0.0666772 -0.1358856 -0.1053526 0.0620325 -0.1091431 0.0630089 -0.0027394 0.0524218 -0.145781 0.0574623 -0.0162253 -0.0604852 0.0888521 -0.1510943 0.0522909 0.0347557 0.0503623 -0.1380065 0.0608241 -0.0458833 -0.0815119 -0.1554737 0.0578719 -0.113534 -0.0165888 0.0084275 0.0438692 0.0292464 0.0785499 0.0500193 0.0524146 0.0624676 0.0201342 0.0519568 -0.0099706 0.0904921 -0.0871865 -0.0995375 -0.0890273 -0.0294143 -0.0768565 0.0011379 0.0587647 -0.0270148 -0.1420965 -0.0595715 -0.0684723 0.0701428 0.0225349 0.0311943 -0.0134363 -0.1190695 0.1052945 0.0280179 0.1171735 -0.0175695 -0.0124866 0.107561 -0.0878482 0.0772583 0.0577055 0.0339142 -0.0970596 0.0650971 -0.0078664 -0.1278468 -0.1531148 0.035295 -0.1200973 -0.0276678 0.0101512 0.0525279 0.0249446 0.0872625 0.0750512 0.0389029 0.0889484 0.010934 0.0454246 -0.0204393 0.0635353 -0.0851559 -0.143786 -0.0145364 -0.0424191 -0.1589758 -0.0186995 0.0591252 -0.0203574 -0.1318282 -0.0440442 -0.0400803 0.0973382 -0.0009704 0.0075895 0.0312409 -0.0942312 0.0691382 -0.0145821 0.1267134 0.0017205 -0.1662032 0.0018639 0.1454977 -0.016715 0.070472 -0.0141922 0.1301684 -0.0146277 0.0150381 -0.0985885 -0.0250343 0.0969844 -0.0138219 0.1719064 0.0381084 0.0853924 0.0328312 0.0667109 -0.0774942 0.016294 -0.1293792 0.0117416 0.1722122 0.0357691 -0.0885357 0.0418257 0.0178493 unknown
polarizability: 89.0451819|-0.5368131|79.5137159|-1.3605897|-3.2593755|88.7698995 unknown
InChI: InChI=1S/C8H16/c1-5-7(3)8(4)6-2/h8H,3,5-6H2,1-2,4H3
charge 0 multiplicity 1
24 atoms
C  0.625609 -0.500354 0.417254
C  1.91382 0.305001 0.101359
C  -0.559272 -0.232327 -0.524753
C  0.932581 -2.026431 0.434571
C  -1.944927 -0.35283 0.104493
C  1.756795 1.831621 0.269201
C  -2.327978 0.892844 0.949347
C  -0.413991 0.058516 -1.845492
H  0.305904 -0.216391 1.443284
H  2.253854 0.070951 -0.927333
H  2.716857 -0.05661 0.775577
H  1.690131 -2.265333 1.204653
H  0.027445 -2.623722 0.648938
H  1.32291 -2.347513 -0.548649
H  -2.706078 -0.498702 -0.68505
H  -1.982106 -1.249706 0.75667
H  0.982584 2.228729 -0.411014
H  2.704843 2.357639 0.052369
H  1.459459 2.085814 1.304666
H  -1.590766 1.080092 1.751607
H  -2.37048 1.794882 0.313187
H  -3.316897 0.756578 1.424667
H  0.567615 0.18082 -2.317246
H  -1.285715 0.191731 -2.497909
