program: Gaussian 09
title: 000103008
version: EM64L-G09RevD.01
frameworkgroup: C1[X(C10H17NO2)]
method: RPBEPBE
basis: SDD
operation: Freq
keyword: #p
keyword: freq=noraman
keyword: PBEPBE/SDD
title: #p freq=noraman PBEPBE/SDD
converged: YES YES NO NO
title: Mulliken charges:
elementType: O O N C C C C C C C C C C H H H H H H H H H H H H H H H H H
charge: -0.274517 -0.255289 -0.062984 -0.146493 -0.138169 -0.486477 -0.484113 -0.464846 -0.487848 0.024441 -0.645349 0.279062 -0.761658 0.232711 0.233621 0.224707 0.233088 0.232162 0.216317 0.229234 0.223566 0.232529 0.208020 0.248590 0.228363 0.227536 0.195639 0.247568 0.246968 0.243619
chargesum: 0.00000
title: Mulliken charges with hydrogens summed into heavy atoms:
elementType: O O N C C C C C C C C C C
charge: -0.274517 -0.255289 -0.062984 0.086218 0.095453 -0.028682 -0.035633 -0.012047 -0.047299 0.273031 0.006189 0.279062 -0.023503
polarizability: 1.40947051e+02 -1.22318949e+00 1.06496759e+02 5.71624999e-01 1.13795668e-02 9.83160779e+01
1716.lowfreq: -11.6849 -3.1785 -0.0004 0.0003 0.0006 18.7566 42.5700 51.6750 63.8304
frequency: 41.9576 51.5314 63.6308 87.7886 164.7490 175.3218 200.2102 218.2442 260.7384 280.8252 318.3654 360.7940 370.5163 437.2313 457.9238 495.3696 568.8697 573.6366 628.3915 693.5069 740.0445 768.0283 776.8424 819.8457 838.5647 854.4391 867.7826 919.8833 953.3139 963.7689 980.0860 981.3112 1001.2012 1034.3435 1041.6348 1043.4670 1070.8229 1104.1406 1113.6145 1128.5033 1148.6435 1156.5294 1194.8172 1202.5156 1211.0547 1223.9356 1243.4895 1255.6809 1273.2278 1290.8004 1293.9989 1311.0663 1315.3449 1344.0722 1352.5517 1364.6211 1383.4036 1427.3043 1448.5684 1453.4523 1455.9418 1461.3802 1464.6527 1467.3412 1482.3403 1489.8217 1641.6352 2882.1079 3002.7737 3003.5773 3005.6490 3008.0200 3015.9373 3021.0231 3023.4454 3041.4891 3051.5159 3056.5045 3072.4667 3076.3520 3078.7436 3082.4346 3097.6199 3140.1627
redmass: 3.5764 1.3010 3.1629 3.1244 3.6715 2.0031 1.0634 3.2286 3.9080 2.2256 3.2215 2.5451 2.5612 2.9261 2.7356 3.3873 3.2597 2.9381 4.5547 4.6052 4.4621 3.1054 1.8592 2.5629 2.3759 4.1674 1.5759 3.2882 3.5609 2.0910 1.8412 2.3127 2.0650 1.9537 1.6622 1.6318 2.0277 1.6257 1.3158 2.0261 1.2861 2.0383 1.5644 1.8114 2.4644 1.4520 1.5930 1.2696 1.3875 1.4788 1.5710 1.3501 1.3105 1.4970 1.4820 1.4022 1.2606 1.1690 1.0878 1.0607 1.0520 1.0919 1.0582 1.0717 1.0520 1.0904 9.3801 1.0536 1.0606 1.0598 1.0378 1.0602 1.0635 1.0843 1.0757 1.0875 1.0890 1.1032 1.1028 1.1037 1.1006 1.1038 1.0952 1.1019
irintensity: 2.0923 0.2829 2.3280 2.7424 0.8096 0.1675 0.0723 7.8028 2.6272 0.0987 2.7969 4.2363 2.2272 9.9880 1.8083 0.5375 1.7565 5.4981 9.1633 6.1442 0.8791 13.6942 3.5273 0.8932 5.1807 13.2413 0.1604 3.1158 50.8151 4.9539 3.2847 1.9121 124.8806 34.6373 22.3367 8.0523 24.4856 6.8781 2.3205 19.0603 3.1798 1.1562 36.8465 122.3288 239.5508 6.8994 3.8500 3.4720 0.7684 5.2458 9.9709 5.9832 0.8193 9.6509 2.2994 4.8077 50.9757 4.2279 8.1665 24.2210 18.0657 8.2524 12.8030 12.4463 1.4250 24.4204 174.2469 107.0455 11.4604 34.0645 3.2230 13.3031 44.4098 6.8428 53.6575 73.2779 9.7845 5.7928 8.2822 39.8837 34.8430 63.8319 9.6438 10.7230
temp: 298.150 k
press: 1.00000 atm
elementType: 8 8 7 6 6 6 6 6 6 6 6 6 6 1 1 1 1 1 1 1 1 1 1 1 1 1 1 1 1 1
symmnumber: 1
zpe: 678696.9 jmol-1
zpe.correction: 0.258502 hartree
zpe.thermalcorrener: 0.271532 hartree
zpe.thermalcorrenthalpy: 0.272476 hartree
zpe.thermalcorrgfe: 0.218483 hartree
zpe.sumelectzpe: -595.424984 hartree
zpe.sumelectthermal: -595.411954 hartree
zpe.sumelectthermalent: -595.411009 hartree
zpe.sumelectthermalfe: -595.465003 hartree
dipole: 1.5961 -0.9542 0.1480
dipole: 1.8655
quadrupole: -71.3799 -83.9739 -77.0256
quadrupole: 7.4116 2.4286 -2.9340
quadrupole: 6.0799 -6.5141 0.4342 7.4116 2.4286 -2.9340
hfenergy: -595.6834858 hartree
pointgroup: C01 [X(C10H17N1O2)]
dipole: -0.6310227 -0.3501136 0.1337762 debye
polarizability: 140.907366|0.3846355|104.9739423|-1.8467078|-3.1675402|99.8785795 unknown
InChI: InChI=1S/C10H17NO2/c1-7(12)13-10-5-8-3-4-9(6-10)11(8)2/h8-10H,3-6H2,1-2H3
charge 0 multiplicity 1
30 atoms
O  1.974417 -0.707889 0.209192
O  2.959891 1.073857 -0.93741
N  -2.097352 -0.257561 0.901353
C  -1.423528 1.047182 0.594031
C  -1.78098 -1.048836 -0.332817
C  -1.798127 1.358621 -0.903108
C  -2.034627 -0.058011 -1.531205
C  0.101369 0.836231 0.781454
C  -0.293564 -1.478961 -0.24002
C  0.610632 -0.235219 -0.205882
C  -3.547969 -0.132333 1.17664
C  3.066275 0.051801 -0.219346
C  4.356981 -0.52818 0.320255
H  -1.77714 1.827916 1.289669
H  -2.423181 -1.945229 -0.381799
H  -0.997631 1.920482 -1.416081
H  -2.71473 1.972505 -0.954162
H  -3.068389 -0.158635 -1.906579
H  -1.357079 -0.260679 -2.379791
H  0.650622 1.782495 0.625332
H  0.277529 0.488397 1.815384
H  -0.153138 -2.057239 0.690204
H  -0.018196 -2.12381 -1.095454
H  0.719748 0.20941 -1.212766
H  -3.690276 0.47438 2.088623
H  -3.96578 -1.136196 1.371355
H  -4.144952 0.334967 0.356474
H  4.338679 -1.62897 0.276209
H  4.476474 -0.238891 1.380303
H  5.209519 -0.133604 -0.251957
