program: Gaussian 09
title: 000103001
version: EM64L-G09RevD.01
frameworkgroup: C1[X(C7H15BrO2)]
method: RPBEPBE
basis: SDD
operation: Freq
keyword: #p
keyword: freq=noraman
keyword: PBEPBE/SDD
title: #p freq=noraman PBEPBE/SDD
converged: YES YES NO NO
title: Mulliken charges:
elementType: Br O O C C C C C C C H H H H H H H H H H H H H H H
charge: -0.031052 -0.252557 -0.259687 0.151109 -0.471466 -0.647725 -0.224750 -0.207214 -0.677799 -0.681486 0.163462 0.277134 0.238153 0.206712 0.275538 0.182910 0.210447 0.179056 0.234983 0.204263 0.241981 0.222975 0.204224 0.239158 0.221632
chargesum: 0.00000
title: Mulliken charges with hydrogens summed into heavy atoms:
elementType: Br O O C C C C C C C
charge: -0.031052 -0.252557 -0.259687 0.314571 -0.194332 0.072677 0.168607 0.206825 -0.008580 -0.016473
polarizability: 1.04113764e+02 1.83978893e+00 1.02119849e+02 -7.74257153e+00 -1.23173176e+00 9.61530888e+01
1716.lowfreq: -8.8181 -0.0005 0.0004 0.0006 7.9701 14.1079 35.9911 56.4212 59.4057
frequency: 35.6084 56.2965 58.9658 64.7158 83.3627 131.7812 169.5985 187.8479 241.7285 244.9931 247.3804 257.0555 268.7081 325.9407 355.7356 498.4271 522.1626 530.2296 630.1326 811.2151 818.4436 845.6046 856.6758 902.2390 965.7183 984.5428 1019.2731 1039.9802 1061.0422 1088.6891 1111.1095 1115.0628 1133.6137 1137.3908 1158.6984 1212.9229 1246.7755 1259.2801 1291.3910 1306.6421 1327.3891 1367.5771 1377.9398 1391.7363 1395.2547 1399.6582 1459.3131 1460.0968 1460.7721 1472.3997 1477.3628 1480.6752 1489.7678 1492.7251 2789.9621 2920.8491 2938.2541 2979.6692 2983.8579 2994.0651 2994.8339 3045.3138 3062.8636 3080.6036 3091.4219 3092.4716 3102.8467 3103.5327 3127.1149
redmass: 4.5105 1.7541 2.6314 3.0132 2.6015 3.2429 4.5871 2.5580 1.2704 1.1447 1.3638 2.4874 3.3150 3.3850 3.2917 4.4348 4.0956 3.8941 3.8203 1.1048 1.1151 2.7198 2.6203 2.5264 2.1757 2.5014 2.0920 3.3981 2.6493 2.6449 2.0670 2.1143 1.4809 1.4649 2.4005 1.2947 1.1555 1.1551 1.1947 1.2789 1.3584 1.3106 1.3023 1.2067 1.2622 1.3116 1.0407 1.0407 1.0407 1.0515 1.0525 1.0508 1.0756 1.0805 1.0787 1.0591 1.0665 1.0426 1.1015 1.0361 1.0358 1.0958 1.0861 1.0910 1.0988 1.0992 1.1012 1.1011 1.1010
irintensity: 0.8057 0.9737 1.0177 0.7658 4.2243 0.7213 2.5596 1.5387 1.0125 1.1086 1.2223 0.2411 3.5050 3.3769 5.4278 26.1595 3.3218 6.6132 0.8675 4.9043 4.0012 5.1975 1.9983 5.6597 120.6267 111.1789 7.4091 158.3351 122.4657 5.7909 1.1388 10.7673 11.6866 8.4085 51.5817 22.3894 4.4965 2.7504 9.4099 65.9973 27.3258 9.8659 6.0936 11.4654 17.5504 26.3047 10.8810 6.8025 15.2509 11.5746 5.8306 6.9070 5.4805 6.3271 76.8527 62.6991 62.5178 24.0855 52.0063 26.3830 20.8810 16.2922 11.7388 24.5081 34.6407 36.8119 34.5956 34.9525 13.6193
temp: 298.150 k
press: 1.00000 atm
elementType: 35 8 8 6 6 6 6 6 6 6 1 1 1 1 1 1 1 1 1 1 1 1 1 1 1
symmnumber: 1
zpe: 554094.2 jmol-1
zpe.correction: 0.211043 hartree
zpe.thermalcorrener: 0.224562 hartree
zpe.thermalcorrenthalpy: 0.225507 hartree
zpe.thermalcorrgfe: 0.168914 hartree
zpe.sumelectzpe: -438.780983 hartree
zpe.sumelectthermal: -438.767464 hartree
zpe.sumelectthermalent: -438.766519 hartree
zpe.sumelectthermalfe: -438.823112 hartree
dipole: -2.0611 1.4958 3.3899
dipole: 4.2399
quadrupole: -69.0471 -67.7791 -68.5712
quadrupole: 1.5132 1.5772 0.8186
quadrupole: -0.5813 0.6867 -0.1054 1.5132 1.5772 0.8186
hfenergy: -438.9920261 hartree
pointgroup: C01 [X(C7H15Br1O2)]
dipole: -0.2099663 -0.5779415 1.5506473 debye
dipolederiv: -0.1641424 0.0128988 -0.0984484 0.0271101 -0.1935114 0.0980607 -0.139552 0.1094139 -0.5187343 -1.2215914 -0.3144241 0.0413998 -0.4057421 -0.6805364 0.0287117 -0.0833202 -0.0739731 -0.3468943 -1.1199483 0.333577 0.0350165 0.4200934 -0.775712 -0.0350927 0.1256183 -0.1122584 -0.3586455 1.3909898 -0.0905015 -0.0109305 0.2849323 0.8048384 -0.0813028 0.0149753 0.3759002 0.3752528 0.0530273 -0.0257808 0.1600783 -0.0135508 0.0711062 -0.1333932 0.1835577 -0.273012 0.8191098 -0.0425063 -0.0432991 -0.0305481 -0.070135 -0.0593281 0.0330921 -0.0974003 -0.0119869 -0.1146227 0.8024833 0.1842944 -0.0806621 0.0435389 0.3457763 -0.0786444 -0.1813102 -0.1476385 0.3726009 0.5305506 -0.2297619 0.0305092 -0.4341167 0.6394468 -0.0180546 0.0857838 -0.0203033 0.3788783 -0.0278384 -0.079212 -0.0310516 -0.0911612 -0.0430172 -0.0384805 -0.0204959 -0.034602 0.0325589 -0.1196273 0.0506974 0.0573022 0.0501543 0.0414408 0.0022267 0.0494917 -0.0007735 0.0353476 -0.0767127 0.0525311 -0.0057106 -0.0406959 -0.07691 0.1430477 0.0069158 -0.0409095 -0.2511951 -0.0836966 0.032016 0.0281385 0.0192008 0.0420959 0.0383968 0.0593908 0.0484265 -0.0966892 0.0636803 0.0674487 -0.0095276 0.0338582 -0.147335 -0.0184255 -0.0090131 0.0085125 0.1107812 0.0689018 -0.0128989 -0.0686896 -0.0210395 0.0912014 0.0507039 -0.0552284 0.046956 -0.1602357 -0.0321826 -0.0035361 0.0505955 0.0137773 0.1318379 -0.0301349 0.0848566 0.0027824 0.0740913 -0.0343629 -0.0284367 -0.0704581 -0.0046966 0.0501462 -0.0120395 0.050515 0.01966 -0.2307495 -0.0979435 0.0571575 -0.0006928 0.1299499 -0.1490514 0.0072615 0.0075921 0.0509665 0.0352201 0.0116107 0.0178091 0.060551 0.0760436 -0.0276813 0.014749 0.0053081 0.1029783 -0.2121927 -0.0073265 -0.0842702 -0.04748 0.0021326 -0.1015769 -0.0387212 -0.0553254 -0.0672409 0.0248994 -0.1581506 -0.0527643 0.081659 -0.0284208 0.0769655 -0.0109489 0.0976021 0.0012164 0.066655 0.1171027 0.0074895 0.002732 -0.0084954 0.0801135 0.0371435 -0.0393576 -0.0070954 -0.1224438 0.0489152 0.1270359 -0.0348923 0.0642337 -0.0974818 0.0321589 -0.0499466 0.0383338 0.0781449 0.0164015 0.0930623 -0.0002527 0.1245913 -0.1265549 0.0283112 -0.0052663 0.0350095 0.1027596 0.0847212 0.0031098 -0.0143116 -0.0339801 0.1025713 0.0614705 0.0317843 0.0401978 -0.1197166 -0.0023548 -0.0742417 -0.0443261 -0.1375823 0.0011561 -0.0800959 -0.0671756 -0.0905603 0.0258196 unknown
polarizability: 103.3287643|0.4160261|98.2030654|5.7266278|-6.5168704|100.8548717 unknown
InChI: InChI=1S/C7H15BrO2/c1-4-9-7(6(3)8)10-5-2/h6-7H,4-5H2,1-3H3
charge 0 multiplicity 1
25 atoms
Br -0.692981 2.172156 -1.655534
O  -0.936431 -0.71274 -0.191526
O  1.293455 -0.000516 -0.069071
C  -0.011836 0.214404 0.462961
C  -0.375283 1.706067 0.305593
C  0.682791 2.645712 0.889512
C  -2.277005 -0.772787 0.420003
C  1.822134 -1.366925 0.158956
C  -2.990604 -1.987262 -0.172926
C  3.258512 -1.378905 -0.357832
H  -0.033766 -0.00709 1.568086
H  -1.366809 1.882643 0.755672
H  0.359678 3.697148 0.815203
H  0.846055 2.405731 1.959766
H  1.639365 2.519174 0.359537
H  -2.183619 -0.862121 1.526555
H  -2.837453 0.157305 0.188454
H  1.77774 -1.594736 1.247572
H  1.184593 -2.091273 -0.379208
H  -4.019627 -2.062363 0.223669
H  -3.043934 -1.895881 -1.271172
H  -2.448733 -2.917229 0.071111
H  3.703483 -2.382396 -0.227729
H  3.279303 -1.123325 -1.431014
H  3.879772 -0.645392 0.184761
