program: Gaussian 09
title: 000103000
version: EM64L-G09RevD.01
frameworkgroup: C1[X(C8H9NO)]
method: RPBEPBE
basis: SDD
operation: Freq
keyword: #pfreq=noraman
keyword: PBEPBE/SDD
title: #p freq=noraman PBEPBE/SDD
converged: NO YES NO NO
title: Mulliken charges:
elementType: O N C C C C C C C C H H H H H H H H H
charge: -0.255881 -0.082875 -0.215099 0.499255 -0.622257 -0.408677 -0.337647 -0.224347 -0.224745 -0.231432 0.211157 0.219557 0.232036 0.255056 0.228214 0.270492 0.228305 0.228804 0.230083
chargesum: 0.00000
title: Mulliken charges with hydrogens summed into heavy atoms:
elementType: O N C C C C C C C C
charge: -0.255881 -0.082875 -0.003942 0.499255 0.084392 -0.180463 -0.067155 0.003958 0.004059 -0.001349
polarizability: 1.35592080e+02 -1.66853484e+00 9.25065616e+01 1.62633486e-01 1.30025860e+00 5.44809754e+01
1716.lowfreq: -13.4687 -2.6095 0.0002 0.0005 0.0007 10.6524 50.4145 104.2001 146.6219
frequency: 50.3055 104.1946 146.6201 208.2576 264.7898 324.6609 372.8321 403.7381 417.7598 523.9062 607.6382 615.0352 659.0344 700.1435 742.3962 795.2248 829.3475 853.1784 927.0098 936.9866 977.5418 989.7846 998.3928 1024.3924 1052.4520 1079.0776 1087.5904 1136.8243 1173.6027 1184.4725 1186.7413 1247.9628 1316.1407 1369.3851 1393.8033 1403.4400 1436.6809 1448.7587 1474.4720 1487.5175 1595.4624 1616.4648 2955.3905 3032.6511 3058.6798 3102.9345 3115.5607 3129.2314 3143.3088 3158.4506 3170.1761
redmass: 4.1388 4.0170 3.8335 1.2258 2.6858 4.0901 4.5255 2.8042 3.7018 3.8709 6.5107 6.2873 6.0696 1.8158 3.0494 2.6025 4.4727 1.2491 1.4354 4.7102 1.3924 6.1953 1.3210 2.2099 1.3044 1.5924 1.5471 1.5295 1.0564 1.5197 1.8700 1.8935 1.4773 2.1284 2.2354 1.4274 1.0502 2.0278 1.0629 2.4707 6.0617 6.0248 1.0362 1.0879 1.0979 1.0995 1.0877 1.0871 1.0922 1.0967 1.0994
irintensity: 3.7426 3.8545 6.9418 0.8957 0.3524 0.4939 2.2195 0.1528 4.1969 14.4411 12.8163 3.8471 1.7388 48.8014 81.3690 6.7025 8.0732 0.0608 1.9855 3.5810 0.0566 0.0580 0.0668 7.4385 3.8110 11.7232 6.3772 0.7048 0.1910 2.9373 0.3442 18.3151 17.2568 19.9818 3.5425 14.4504 9.5100 17.0236 13.8823 2.5480 0.4131 0.5431 43.8758 34.2293 23.1555 18.0590 9.0867 1.7179 26.7722 24.4442 11.6714
temp: 298.150 k
press: 1.00000 atm
elementType: 8 7 6 6 6 6 6 6 6 6 1 1 1 1 1 1 1 1 1
symmnumber: 1
zpe: 394949.5 jmol-1
zpe.correction: 0.150428 hartree
zpe.thermalcorrener: 0.159360 hartree
zpe.thermalcorrenthalpy: 0.160304 hartree
zpe.thermalcorrgfe: 0.116066 hartree
zpe.sumelectzpe: -439.404317 hartree
zpe.sumelectthermal: -439.395385 hartree
zpe.sumelectthermalent: -439.394441 hartree
zpe.sumelectthermalfe: -439.438679 hartree
dipole: -0.2697 2.0213 -1.7190
dipole: 2.6671
quadrupole: -48.1103 -53.4238 -64.6450
quadrupole: 3.9992 -4.2400 0.4136
quadrupole: 7.2827 1.9693 -9.2520 3.9992 -4.2400 0.4136
hfenergy: -439.5547452 hartree
pointgroup: C01 [X(C8H9N1O1)]
dipole: -0.0515232 0.9889084 -0.3470859 debye
dipolederiv: -0.6038543 -0.0227302 -0.0575281 0.1397646 -0.2708345 0.0970654 -0.1306694 0.2299102 -0.518727 -0.2221158 0.0495848 -0.034748 0.0564125 -0.0415464 -0.1411629 0.0168273 -0.1387767 -0.0189216 0.8816311 0.0508274 0.083474 0.01714 0.3001074 0.069071 0.2734759 -0.013068 0.2872189 -0.0934633 -0.0478009 -0.0373525 -0.0294787 -0.0770391 -0.0202157 0.0052188 0.0020146 -0.030967 0.1700604 -0.038209 0.0008469 -0.0022345 0.1062806 0.0615211 -0.004372 0.0416398 0.1573631 -0.040273 0.085261 0.06073 -0.0278634 0.0263022 0.0799707 -0.00328 0.0915766 -0.1172873 -0.0113811 -0.0930858 -0.0184098 -0.0438175 -0.0135941 0.0405613 0.0086967 0.0290972 -0.1051959 -0.0239423 -0.1212466 -0.030011 -0.1317861 0.0119524 0.0484461 -0.0376861 0.0523924 -0.1372974 -0.0844236 0.0957452 0.0530483 0.0920429 0.063401 0.1030396 0.0415218 0.104757 -0.1009353 0.0844194 0.0032359 0.0407939 0.0055085 -0.0442267 0.0493184 0.0358465 0.0475141 -0.1295949 -0.0439432 -0.0291473 -0.0211545 -0.0471183 -0.1241846 -0.0653682 -0.0174591 -0.0656187 0.0564017 -0.0197921 -0.0308939 0.0321843 -0.120419 -0.0134454 -0.1013114 -0.092387 -0.1422761 -0.0449704 0.042569 0.001985 0.0015904 -0.0549812 0.0468671 0.10843 0.0057586 0.0958952 -0.041367 -0.0814259 0.0712598 0.0330912 0.1128245 -0.0049713 -0.0111749 -0.0094744 -0.0197237 0.1159349 0.057059 -0.0842499 -0.0524232 -0.0615172 -0.0364609 -0.0898862 -0.0402182 -0.0934405 0.106429 0.0794962 0.0804517 0.0140725 0.0714115 0.0422074 -0.0420235 0.0202053 -0.0372153 0.1350982 -0.0094604 0.1005557 0.0191254 0.1123566 -0.0225562 -0.0613922 0.0241016 -0.0619508 0.137322 0.0442403 -0.0576465 -0.0395568 -0.0724387 -0.0478863 -0.0962729 -0.0477781 -0.0945401 0.1084373 -0.1254004 -0.0138965 -0.047773 -0.0158068 0.0996274 -0.0286158 -0.048328 -0.0281873 0.1410585 unknown
polarizability: 135.2550304|-4.1800972|86.9351324|2.9208543|13.5889497|60.3894538 unknown
InChI: InChI=1S/C8H9NO/c1-9-8(10-9)7-5-3-2-4-6-7/h2-6,8H,1H3
charge 0 multiplicity 1
19 atoms
O  2.013996 -0.791534 1.221159
N  2.281184 -0.379088 -0.28618
C  1.305588 0.351141 0.565856
C  -0.14785 0.217315 0.26958
C  3.622674 0.267786 -0.375234
C  -1.030536 1.278319 0.589523
C  -0.658523 -0.971476 -0.312469
C  -2.413617 1.158016 0.326263
C  -2.038875 -1.089735 -0.574952
C  -2.919479 -0.026399 -0.256865
H  1.622686 1.33344 0.958715
H  3.860097 0.925908 0.484978
H  3.628144 0.859192 -1.310735
H  4.385833 -0.523559 -0.449432
H  -0.638403 2.196699 1.045391
H  0.038395 -1.780526 -0.553279
H  -3.092099 1.981381 0.575547
H  -2.432609 -2.007496 -1.02585
H  -3.992007 -0.122385 -0.460516
